{"text_format":"1","workbook":"xlsx","n_sheets":7,"sheets":["Accueil","Données","STATS CP","STATS RTT ","Saisies","Personnel","Feuil1"],"not_rendered":{"charts":0,"images":0,"macros":1,"external_links":0,"defined_names":27,"comments":2,"pivot_tables":3},"unopened":[],"bounds":{"document_bytes":16777216,"sheet_cells":100000,"rows_first":2000,"rows_last":500,"rows_between":2000,"halvings":0,"cell_chars":16384,"cell_head_chars":4096},"cells_cut":0,"cells_raw":0,"read":"whole","date_system":"1900"}

{"sheet":"Accueil","index":0,"n_rows":27,"n_cols":32,"rows_kept":27,"cut":false,"hidden":false,"merged":[[3,23,3,25],[11,26,12,26],[11,27,12,27],[11,20,12,21],[11,22,12,24],[11,25,12,25],[5,20,5,21],[7,20,7,21],[4,20,4,27],[6,20,6,27],[5,24,5,25],[5,22,5,23],[9,20,9,21],[7,25,7,26],[9,25,9,26],[3,26,3,27],[15,20,15,21],[16,20,16,21],[1,2,1,4],[2,2,2,4],[3,1,3,5],[3,20,3,22]]}
[]
[null,{"$f":"TODAY()","v":"2015-11-19"},"g.bearzatto",null,null,null,null,null,"Salarié","NATURE","Formule"]
[null,"Bonjour   ",{"$f":"INDEX(Personnel!$A$4:$C$51,MATCH($C$2,Personnel!$C$4:$C$51,0),1)","v":"BEARZATTO Giovanni"},{"$f":"INDEX(Personnel!$A$4:$C$51,MATCH($C$2,Personnel!$C$4:$C$51,0),1)","v":"BEARZATTO Giovanni"},{"$f":"INDEX(Personnel!$A$4:$C$51,MATCH($C$2,Personnel!$C$4:$C$51,0),1)","v":"BEARZATTO Giovanni"},null,null,null,{"$f":"SALARIE","v":"BEARZATTO Giovanni"},"CP",{"$f":"AND(Saisies!C4>=Accueil!C6,Saisies!E4<=Accueil!E6)","v":false}]
[null,"Situation à ce jour sauf erreur ou omission",null,null,null,null,null,null,{"$f":"SALARIE","v":"BEARZATTO Giovanni"},"RTT",{"$f":"AND(Saisies!C4>=RTTdeb,Saisies!E4<=RTTfin)","v":false},null,null,null,null,null,null,null,null,null,"Demande",null,null,"CP"]
[]
[null,"Congés Payés période du",{"$f":"CPdeb","v":"2015-06-01"},"au",{"$f":"CPfin","v":"2016-05-31"},null,null,null,null,null,null,null,null,null,null,null,null,null,null,null,"Nom & Prénom :",null,{"$f":"SALARIE","v":"BEARZATTO Giovanni"},null,"Date demande ",null,{"$f":"TODAY()","v":"2015-11-19"}]
[null,null,null,null,null,null,null,null,"Salarié","Date demande","début","J1","fin","J2","Nature","Statut","NB jours","mois","Remarque"]
[null,"Solde Période précédente",{"$f":"IF(SALARIE<>\"\",VLOOKUP(SALARIE,PERSONNEL[],8,FALSE),\"\")","v":1.5},null,null,null,null,null,"BEARZATTO Giovanni","2014-12-01","2015-01-02",0,"2015-01-02",0,"RTT","Acceptée",1,"2015/01","RTT Direction",null," Période demandée du :",null,"2015-11-19",null,null,"inclus",null,{"$f":"IF(OR(Y8=\"Matin\",Y8=\"\"),0,0.5)","v":0}]
[null,"CP pour ancienneté",{"$f":"IF(SALARIE<>\"\",VLOOKUP(SALARIE,PERSONNEL[],9,FALSE),\"\")","v":3},null,null,null,null,null,"BEARZATTO Giovanni","2015-01-07","2015-02-19",0,"2015-02-19",0,"RTT","Acceptée",1,"2015/02",0,null,null,null,null,null,"N'utiliser ces cases que pour des 1/2 journées "]
[null,"Acquis au 31/05/2015 (N-1)",{"$f":"IF(SALARIE<>\"\",VLOOKUP(SALARIE,PERSONNEL[],10,FALSE)-C8-C9,\"\")","v":24.96},null,"SOLDES",null,null,null,"BEARZATTO Giovanni","2015-01-07","2015-03-04",0,"2015-03-04",0,"RTT","Acceptée",1,"2015/03",0,null,"au :",null,"2015-11-19",null,null,"inclus",null,{"$f":"IF(OR(Y10=\"Après-midi\",Y10=\"\"),0,0.5)","v":0}]
[null,"TOTAL CP à prendre sur la période",{"$f":"IF(SALARIE<>\"\",C10+C9+C8,\"\")","v":29.46},null,null,null,null,null,"BEARZATTO Giovanni","2015-05-04","2015-05-15",0,"2015-05-15",0,"RTT","Acceptée",1,"2015/05",""]
[null,"NBj CP Posés et Acceptés",{"$f":"SUM(SUMIFS(Tabsaisies[NB jours],Tabsaisies[Début],\">=\"&CPdeb,Tabsaisies[Début],\"<=\"&CPfin,Tabsaisies[Salarié],\"=\"&SALARIE,Tabsaisies[Nature],\"=CP\",Tabsaisies[Statut],{\"Annulée\";\"Acceptée\"}))","v":17},null,{"$f":"IF(SALARIE<>\"\",C11-C12,\"\")","v":12.46},null,null,null,"BEARZATTO Giovanni","2015-06-08","2015-06-22",0,"2015-06-22",0,"CP","Acceptée",1,"2015/06","Recup CP du 01/06/2015 annulé",null,"MOTIF --->\n(uniquement si Abs. Convention)",null,null,null,null,"soit :",{"$f":"IF(OR(W8=\"\",W10=\"\"),0,IF(AND(X4<>\"CP\",X4<>\"RTT\",W8<>\"\"),0,IF(U4=\"Demande\",NETWORKDAYS.INTL(W8,W10,1,JFERIES)-AB8-AB10,(NETWORKDAYS.INTL(W8,W10,1,JFERIES)-AB8-AB10)*-1)))","v":1},"jours"]
[null,"CP en attente de réponse",{"$f":"SUMIFS(Tabsaisies[NB jours],Tabsaisies[Début],\">=\"&CPdeb,Tabsaisies[Début],\"<=\"&CPfin,Tabsaisies[Salarié],\"=\"&SALARIE,Tabsaisies[Nature],\"=CP\",Tabsaisies[Statut],\"=En Attente\")","v":0},null,{"$f":"IF(C13>0,E12-C13,\"\")","v":""},null,null,null,"BEARZATTO Giovanni","2015-06-09","2015-07-13",0,"2015-07-13",0,"RTT","Acceptée",1,"2015/07",""]
[null,"Pour info, acquis depuis le 01/06/2015",{"$f":"IF(SALARIE<>\"\",VLOOKUP(SALARIE,PERSONNEL[],11,FALSE),\"\")","v":10.4},null,{"$f":"IF(SALARIE<>\"\",E12+C14,\"\")","v":22.86},null,null,null,"BEARZATTO Giovanni","2015-07-09","2015-08-17",0,"2015-08-31",0,"CP","Acceptée",11,"2015/08","Congés été 2015",null," Nouveau solde prévisonnel (hors demandes en cours) :",null,null,null,{"$f":"IF(AA12=0,\"\",IF(X4=\"CP\",E12-AA12,E21-AA12))","v":11.46},null,null,""]
[null,null,null,null,null,null,null,null,"BEARZATTO Giovanni","2015-07-09","2015-09-01",0,"2015-09-04",0,"CP","Acceptée",4,"2015/09","Congés été 2015"]
[null,"RTT période du ",{"$f":"RTTdeb","v":"2015-01-01"},"au",{"$f":"RTTfin","v":"2015-12-31"},null,null,null,"BEARZATTO Giovanni","2015-09-14","2015-10-12",0,"2015-10-12",0,"CP","Acceptée",1,"2015/10","",null,"Destinataire :",null,"g.bearzatto@lse.fr"]
[null,"Solde Période précédente",{"$f":"IF(SALARIE<>\"\",VLOOKUP(SALARIE,PERSONNEL[],14,FALSE),\"\")","v":3},null,null,null,null,null,null,null,null,null,null,null,null,null,null,null,null,null,"Depuis et Copie à :",null,{"$f":"IF(SALARIE<>\"\",VLOOKUP(SALARIE,PERSONNEL[],3,FALSE)&\"@lse.fr\",\"\")","v":"g.bearzatto@lse.fr"}]
[null,"Acquis à ce jour ",{"$f":"IF(SALARIE<>\"\",C20-C17,\"\")","v":2}]
[null,"(tenant compte d'éventuelles  Abs)"]
[null,"TOTAL RTT à Prendre",{"$f":"IF(SALARIE<>\"\",VLOOKUP(SALARIE,PERSONNEL[],27,FALSE),\"\")","v":5},null,"SOLDES"]
[null,"RTT Posé et Acceptés",{"$f":"SUM(SUMIFS(Tabsaisies[NB jours],Tabsaisies[Début],\">=\"&RTTdeb,Tabsaisies[Début],\"<=\"&RTTfin,Tabsaisies[Salarié],\"=\"&SALARIE,Tabsaisies[Nature],\"=RTT\",Tabsaisies[Statut],{\"Acceptée\";\"Annulée\"}))","v":5},null,{"$f":"IF(SALARIE<>\"\",C20-C21,\"\")","v":0},null,null,null,null,null,null,null,null,null,null,null,null,null,null,"*",{"$f":"W6","v":"BEARZATTO Giovanni"},{"$f":"AA6","v":"2015-11-19"},{"$f":"W8","v":"2015-11-19"},{"$f":"AB8","v":0},{"$f":"W10","v":"2015-11-19"},{"$f":"AB10","v":0},{"$f":"X4","v":"CP"},"En attente",{"$f":"AA12","v":1},{"$f":"YEAR(W21)&\"/\"&TEXT(W21,\"mm\")","v":"2015/11"},"",{"$f":"Y14","v":11.46}]
[null,"RTT en attente de réponse",{"$f":"SUMIFS(Tabsaisies[NB jours],Tabsaisies[Début],\">=\"&RTTdeb,Tabsaisies[Début],\"<=\"&RTTfin,Tabsaisies[Salarié],\"=\"&SALARIE,Tabsaisies[Nature],\"=RTT\",Tabsaisies[Statut],\"=En Attente\")","v":0},null,""]
[]
[]
[]
[]
["*",{"$f":"INDEX(Personnel!$A$4:$C$51,MATCH($C$2,Personnel!$C$4:$C$51,0),1)","v":"BEARZATTO Giovanni"}]

{"sheet":"Données","index":1,"n_rows":49,"n_cols":8,"rows_kept":49,"cut":false,"hidden":false,"merged":[[4,0,4,1]]}
["ANNEE EN COURS",2015]
["CP du",{"$f":"DATE(ANNEE_LSE,6,1)","v":"2015-06-01"},"au",{"$f":"DATE(ANNEE_LSE+1,5,31)","v":"2016-05-31"}]
["RTT du ",{"$f":"DATE(ANNEE_LSE,1,1)","v":"2015-01-01"},"au",{"$f":"DATE(ANNEE_LSE,12,31)","v":"2015-12-31"}]
[]
["JOURS FERIES ",null,null,"Nature Absences",null,null,"NO","Michel Loyer <m.loyer@lse.fr>;Giovanni Bearzatto <g.bearzatto@lse.fr>"]
["Jour de l'an","2013-01-01",null,"CP",null,null,"IDF","Giovanni Bearzatto <g.bearzatto@lse.fr>"]
["Lundi de Pâques","2013-04-01",null,"RTT",null,null,"SUD","Giovanni Bearzatto <g.bearzatto@lse.fr>"]
["Fête du Travail","2013-05-01",null,"Convention"]
["8 mai 1945","2013-05-08",null,"CP sans solde"]
["Jeudi de l'Ascension","2013-05-09",null,"RTD Recup"]
["Lundi de Pentecôte","2013-05-20"]
["Fête Nationale","2013-07-14"]
["Assomption","2013-08-15"]
["La Toussaint","2013-11-01"]
["Armistice","2013-11-11"]
["Noël","2013-12-25"]
["Jour de l'an","2014-01-01"]
["Lundi de Pâques","2014-04-21"]
["Fête du Travail","2014-05-01"]
["8 mai 1945","2014-05-08"]
["Jeudi de l'Ascension","2014-05-29"]
["Lundi de Pentecôte"]
["Fête Nationale","2014-07-14"]
["Assomption","2014-08-15"]
["La Toussaint","2014-11-01"]
["Armistice","2014-11-11"]
["Noël","2014-12-25"]
["Jour de l'an","2015-01-01"]
["Lundi de Pâques","2015-04-06"]
["Fête du Travail","2015-05-01"]
["8 mai 1945","2015-05-08"]
["Jeudi de l'Ascension","2015-05-14"]
["Lundi de Pentecôte","2015-05-25"]
["Fête Nationale","2015-07-14"]
["Assomption","2015-08-15"]
["La Toussaint","2015-11-01"]
["Armistice","2015-11-11"]
["Noël","2015-12-25"]
["Jour de l'an","2016-01-01"]
["Lundi de Pâques","2016-03-28"]
["Fête du Travail","2016-05-01"]
["8 mai 1945","2016-05-08"]
["Jeudi de l'Ascension","2016-05-05"]
["Lundi de Pentecôte","2016-05-16"]
["Fête Nationale","2016-07-14"]
["Assomption","2016-08-15"]
["La Toussaint","2016-11-01"]
["Armistice","2016-11-11"]
["Noël","2016-12-25"]

{"sheet":"STATS CP","index":2,"n_rows":37,"n_cols":14,"rows_kept":37,"cut":false,"hidden":false,"merged":[]}
["Nature","CP"]
["Statut","(Plusieurs éléments)"]
[]
["Somme de NB jours","Mois"]
["Étiquettes de lignes","2014/06","2014/07","2014/08","2014/09","2014/10","2014/11","2014/12","2015/01","2015/02","2015/03","2015/04","2015/05","Total général"]
["BEARZATTO Giovanni",null,1,10,6,null,null,null,null,6,2,null,1,26]
["BERTHE Magali",null,null,9,null,null,1.5,null,1,null,null,null,1,12.5]
["CHEVALIER Yohan",null,4,5,null,null,null,null,null,null,null,null,2,11]
["COUTANT Jean Paul",1,null,15,null,null,null,null,null,null,1,5,1,23]
["DEREPPE Bruno",null,4,10,5,null,null,null,null,null,5,null,4,28]
["DREVON Alain",null,4,6,5,null,null,null,null,5,null,null,5.5,25.5]
["DREZET Olivier",1,null,16,4,null,1,1,null,null,null,4,1,28]
["GIRAUDON Alain",1,null,20,null,null,null,null,null,null,5,null,null,26]
["GUERIN Viviane",1,1,17,1,null,null,null,null,null,null,null,5,25]
["GUINOT Nathalie",null,null,15,null,null,null,null,null,5,null,2,3,25]
["GUIOT Fabien",null,null,15,null,null,null,1,null,null,null,4,5,25]
["HAUTEBRANC Alexis",null,4,6,5,1,null,0.5,null,null,2.5,null,6,25]
["HEMLER Christelle",null,4,6,5,null,null,0.5,null,null,2,2,6,25.5]
["KADEM Christophe",null,null,15,null,null,null,1,null,null,5,null,4.5,25.5]
["LANGE Sébastien",null,null,null,null,null,null,null,1,null,null,null,0.5,1.5]
["LAZZARO Fabien",null,4,11,null,null,null,null,null,null,null,null,null,15]
["LEDANT Charles",null,null,17,null,null,1,null,2,null,3,1,5,29]
["LOCATELLI Bruno",null,null,5,11,null,null,null,null,null,5,1,5,27]
["LOYER Michel",1,7,10,1,1,null,1,null,null,2,null,3,26]
["MARAIS Bernard",null,null,9,null,10,null,1,1,5,null,null,1,27]
["MARZOUK Sami",null,null,20,null,null,null,1,null,null,null,8,null,29]
["MINAKIAN Mathilde",null,1,15,null,null,1,null,1,null,null,null,null,18]
["PLONQUET Christian",null,null,17,5,0,2,null,null,null,null,null,null,24]
["POMMERELL Patrick",null,null,15,null,null,null,null,null,2,null,4,0,21]
["PONS Olivier",null,5,10,null,null,null,null,null,null,7,null,null,22]
["ROBIN Kevin",null,1,15,null,null,1,1.5,1,2,1,1.5,null,24]
["SANTUCCI Lionel",null,null,15,1,null,null,1,null,null,2,3,8,30]
["SIODMAK Eric",null,null,14,2,null,null,1,null,5,0,null,4,26]
["SOUCHET Alain",null,null,null,20,null,null,null,null,null,null,2.5,7,29.5]
["TAQUET Alain",2,null,14,1,null,null,null,null,null,4,null,5.5,26.5]
["VAUTRAIN Franck",null,null,15,null,null,null,null,null,null,null,5,5,25]
["Total général",7,40,367,72,12,7.5,10.5,7,30,46.5,43,89,731.5]

{"sheet":"STATS RTT ","index":3,"n_rows":30,"n_cols":15,"rows_kept":30,"cut":false,"hidden":false,"merged":[]}
["Nature","RTT"]
["Statut","Acceptée"]
[]
["Somme de NB jours","Mois"]
["Étiquettes de lignes","2015/01","2015/02","2015/03","2015/04","2015/05","2015/06","2015/07","Total général"]
["BEARZATTO Giovanni",1,1,1,null,1,null,null,4]
["COUTANT Jean Paul",1,null,2,null,1,null,null,4]
["DEREPPE Bruno",1,null,null,null,1,null,null,2]
["DREVON Alain",1,null,null,3,null,null,null,4]
["DREZET Olivier",1,1,1.5,null,0.5,null,null,4]
["GIRAUDON Alain",1,1,0.5,null,1,null,1,4.5]
["GUERIN Viviane",2,1,null,null,null,1,1,5]
["GUINOT Nathalie",1,null,null,null,null,null,null,1]
["GUIOT Fabien",1,1,null,null,null,null,null,2,null,null,null,null,null,4]
["HAUTEBRANC Alexis",1,null,null,null,null,null,null,1]
["HEMLER Christelle",1,0.5,null,null,null,null,null,1.5]
["KADEM Christophe",1,null,2,null,null,null,null,3]
["LAZZARO Fabien",1,null,null,null,null,null,null,1]
["LEDANT Charles",1,null,null,1,null,null,null,2]
["LOCATELLI Bruno",3,null,null,null,null,1,null,4]
["LOYER Michel",1,null,1,null,1,null,null,3]
["MARZOUK Sami",1,null,null,null,null,null,null,1]
["POMMERELL Patrick",1,null,0.5,0.5,null,1,null,3]
["PONS Olivier",2,1,null,null,1,null,null,4]
["SANTUCCI Lionel",2,null,null,null,2,null,null,4]
["SIODMAK Eric",1,null,null,null,null,null,null,1]
["SOUCHET Alain",1,null,null,null,null,null,null,1]
["TAQUET Alain",1,1,1,null,null,null,1,4]
["VAUTRAIN Franck",2,1,1,0.5,null,null,null,4.5]
["Total général",30,8.5,10.5,5,8.5,3,3,68.5]

{"sheet":"Saisies","index":4,"n_rows":992,"n_cols":12,"rows_kept":992,"cut":false,"hidden":false,"merged":[[0,0,0,1]]}
["PENSER A CLIQUER SUR SAUVER",null,null,null,null,null,null,null,"Liste des demandes au ",{"$f":"AUJOURDHUI()","v":{"$error":"#NAME?"}}]
[null,null,null,null,null,null,null,"Sous-total",2526.5]
["Salarié","Date demande","Début","J1","Fin","J2","Nature","Statut","NB jours","mois","Remarque","verif solde"]
["SANTUCCI Lionel","2013-06-04","2013-06-07",0,"2013-06-10",0,"CP","Acceptée",2,"2013/06"]
["SANTUCCI Lionel","2013-06-04","2013-06-12",0,"2013-06-14",0,"CP","Acceptée",3,"2013/06"]
["DREVON Alain","2013-06-01","2013-06-12",0,"2013-06-12",0.5,"CP","Acceptée",0.5,"2013/06"]
["DREVON Alain","2013-06-01","2013-06-14",0,"2013-06-14",0.5,"CP","Acceptée",0.5,"2013/06"]
["DREVON Alain","2013-06-01","2013-06-28",0,"2013-06-28",0,"CP","Acceptée",1,"2013/06"]
["DREVON Alain","2013-05-21","2013-08-16",0,"2013-08-30",0,"CP","Acceptée",11,"2013/08"]
["LEDANT Charles","2013-05-21","2013-08-05",0,"2013-08-30",0,"CP","Acceptée",19,"2013/08"]
["LOCATELLI Bruno","2013-06-01","2013-06-03",0,"2013-06-03",0,"CP","Acceptée",1,"2013/06"]
["LOCATELLI Bruno","2013-06-01","2013-06-10",0,"2013-06-10",0,"CP","Acceptée",1,"2013/06"]
["LOCATELLI Bruno","2013-06-01","2013-06-19",0,"2013-06-19",0.5,"CP","Acceptée",0.5,"2013/06"]
["LOCATELLI Bruno","2013-06-01","2013-06-24",0,"2013-06-24",0,"CP","Acceptée",1,"2013/06"]
["LOCATELLI Bruno","2013-07-01","2013-07-01",0.5,"2013-07-01",0,"CP","Acceptée",0.5,"2013/07"]
["LOCATELLI Bruno","2013-07-01","2013-07-05",0.5,"2013-07-08",0,"CP","Acceptée",1.5,"2013/07"]
["LOCATELLI Bruno","2013-04-08","2013-07-25",0,"2013-07-31",0,"CP","Acceptée",5,"2013/07"]
["LOCATELLI Bruno","2013-08-01","2013-08-16",0,"2013-08-16",0,"CP","Acceptée",1,"2013/08"]
["LOCATELLI Bruno","2013-04-08","2013-08-26",0,"2013-08-31",0,"CP","Acceptée",5,"2013/08"]
["LOCATELLI Bruno","2013-04-08","2013-09-01",0,"2013-09-06",0,"CP","Acceptée",5,"2013/09"]
["MARAIS Bernard","2013-05-28","2013-07-01",0,"2013-07-12",0,"CP","Acceptée",10,"2013/07","g.bearzatto"]
["PONS Olivier","2013-05-28","2013-07-29",0,"2013-07-31",0,"CP","Acceptée",3,"2013/07"]
["PONS Olivier","2013-05-28","2013-08-01",0,"2013-08-19",0,"CP","Acceptée",12,"2013/08"]
["SANTUCCI Lionel","2013-05-28","2013-07-29",0,"2013-07-31",0,"CP","Acceptée",3,"2013/07"]
["SANTUCCI Lionel","2013-05-28","2013-08-01",0,"2013-08-19",0,"CP","Acceptée",12,"2013/08"]
["VAUTRAIN Franck","2013-06-03","2013-06-14",0.5,"2013-06-17",0,"CP","Acceptée",1.5,"2013/06"]
["VAUTRAIN Franck","2013-06-03","2013-06-05",0.5,"2013-06-05",0,"CP","Acceptée",0.5,"2013/06"]
["LAHAYE Laure","2013-06-03","2013-06-13",0.5,"2013-06-14",0,"CP","Acceptée",1.5,"2013/06"]
["PONS Olivier","2013-06-03","2013-06-06",0,"2013-06-06",0,"CP","Acceptée",1,"2013/06"]
["LEDANT Charles","2013-06-03","2013-06-14",0,"2013-06-17",0,"CP","Acceptée",2,"2013/06"]
["LEDANT Charles","2013-06-03","2013-06-07",0,"2013-06-07",0,"CP","Acceptée",1,"2013/06"]
["HAUTEBRANC Alexis","2013-06-03","2013-06-07",0,"2013-06-07",0,"CP","Acceptée",1,"2013/06","Remplace demande du 30/05"]
["HAUTEBRANC Alexis","2013-06-03","2013-06-21",0,"2013-06-21",0,"CP","Acceptée",1,"2013/06"]
["CHEVALIER Yohan","2013-06-03","2013-06-13",0,"2013-06-14",0,"CP","Acceptée",2,"2013/06"]
["BELBEY Dounia","2013-05-28","2013-06-03",0,"2013-06-03",0,"RTT","Acceptée",1,"2013/06"]
["TAQUET Alain","2013-05-29","2013-08-12",0,"2013-08-30",0,"CP","Acceptée",14,"2013/08","a compléter"]
["DREVON Alain","2013-05-21","2013-07-22",0,"2013-07-26",0,"CP","Refusée",0,"2013/07","Hors période autorisée"]
["BEARZATTO Giovanni","2013-06-06","2013-06-07",0.5,"2013-06-07",0,"CP","Acceptée",0.5,"2013/06"]
["PONS Olivier","2013-06-06","2013-06-05",0,"2013-06-05",0,"CP","Acceptée",1,"2013/06",0]
["HAUTCLOCQ Claude","2013-06-05","2013-08-01",0,"2013-08-23",0,"CP","Acceptée",16,"2013/08"]
["HAUTCLOCQ Claude","2013-06-05","2013-08-26",0,"2013-08-27",0,"RTT","Acceptée",2,"2013/08"]
["PLONQUET Christian","2013-06-05","2013-07-29",0,"2013-07-31",0,"CP","Acceptée",3,"2013/07"]
["PLONQUET Christian","2013-06-05","2013-08-01",0,"2013-08-23",0,"CP","Acceptée",16,"2013/08"]
["HEMLER Christelle","2013-06-06","2013-06-10",0,"2013-06-10",0,"CP","Acceptée",1,"2013/06"]
["HEMLER Christelle","2013-06-06","2013-06-17",0,"2013-06-17",0,"CP","Acceptée",1,"2013/06"]
["HEMLER Christelle","2013-06-06","2013-06-26",0,"2013-06-26",0,"CP","Acceptée",1,"2013/06"]
["HEMLER Christelle","2013-06-06","2013-07-01",0,"2013-07-01",0,"CP","Acceptée",1,"2013/07"]
["HEMLER Christelle","2013-06-06","2013-07-24",0,"2013-07-24",0,"CP","Acceptée",1,"2013/07"]
["HEMLER Christelle","2013-06-06","2013-07-29",0,"2013-07-31",0,"CP","Acceptée",3,"2013/07"]
["HEMLER Christelle","2013-06-06","2013-08-01",0,"2013-08-09",0,"CP","Acceptée",7,"2013/08"]
["HEMLER Christelle","2013-06-06","2013-09-02",0,"2013-09-06",0,"CP","Acceptée",5,"2013/09"]
["DEREPPE Bruno","2013-06-06","2013-06-07",0,"2013-06-07",0,"CP","Acceptée",1,"2013/06"]
["DEREPPE Bruno","2013-06-06","2013-07-25",0,"2013-07-31",0,"CP","Acceptée",5,"2013/07"]
["DEREPPE Bruno","2013-06-06","2013-08-01",0,"2013-08-19",0,"CP","Acceptée",12,"2013/08"]
["MARZOUK Sami","2013-06-06","2013-07-29",0,"2013-07-31",0,"CP","Acceptée",3,"2013/07"]
["MARZOUK Sami","2013-06-06","2013-08-01",0,"2013-08-30",0,"CP","Acceptée",21,"2013/08"]
["POMMERELL Patrick","2013-06-04","2013-06-04",0,"2013-06-04",0,"CP","Acceptée",1,"2013/06"]
["POMMERELL Patrick","2013-06-04","2013-06-07",0.5,"2013-06-10",0,"CP","Acceptée",1.5,"2013/06"]
["POMMERELL Patrick","2013-06-06","2013-08-05",0,"2013-08-16",0,"CP","Acceptée",9,"2013/08"]
["BEARZATTO Giovanni","2013-06-06","2013-06-24",0,"2013-06-24",0,"RTT","Acceptée",1,"2013/06"]
["BEARZATTO Giovanni","2013-06-06","2013-08-16",0,"2013-08-16",0,"RTT","Acceptée",1,"2013/08"]
["BEARZATTO Giovanni","2013-06-06","2013-08-19",0,"2013-08-31",0,"CP","Acceptée",10,"2013/08"]
["BEARZATTO Giovanni","2013-06-06","2013-09-01",0,"2013-09-09",0,"CP","Acceptée",6,"2013/09"]
["DREZET Olivier","2013-06-12","2013-06-14",0,"2013-06-14",0,"CP","Acceptée",1,"2013/06"]
["DREZET Olivier","2013-05-31","2013-08-05",0,"2013-08-23",0,"CP","Acceptée",14,"2013/08"]
["GUIOT Fabien","2013-06-03","2013-06-03",0,"2013-06-04",0,"CP","Acceptée",2,"2013/06","31/05 passé sur juin"]
["PONS Olivier","2013-06-10","2013-06-13",0,"2013-06-14",0,"CP","Acceptée",2,"2013/06"]
["PONS Olivier","2013-06-07","2013-06-07",0,"2013-06-07",0,"CP","Acceptée",1,"2013/06"]
["LAHAYE Laure","2013-06-11","2013-07-09",0.5,"2013-07-09",0,"RTT","Acceptée",0.5,"2013/07"]
["BELBEY Dounia","2013-06-13","2013-06-25",0.5,"2013-06-25",0,"CP","Acceptée",0.5,"2013/06"]
["GUERIN Viviane","2013-05-30","2013-01-31",0,"2013-01-31",0,"RTT","Acceptée",1,"2013/01"]
["GUERIN Viviane","2013-05-30","2013-03-28",0,"2013-03-28",0,"RTT","Acceptée",1,"2013/03"]
["GUERIN Viviane","2013-10-18","2013-11-04",0,"2013-11-04",0,"RTT","Acceptée",1,"2013/11","remplacemt du 25/11 initialement prévu"]
["GUERIN Viviane","2013-06-14","2013-07-15",0,"2013-07-15",0,"RTT","Acceptée",1,"2013/07"]
["COUTANT Jean Paul","2013-06-19","2013-06-28",0,"2013-06-28",0.5,"CP","Acceptée",0.5,"2013/06"]
["COUTANT Jean Paul","2013-06-19","2013-07-12",0.5,"2013-07-15",0,"CP","Acceptée",1.5,"2013/07"]
["GUINOT Nathalie","2013-06-05","2013-06-05",0,"2013-06-05",0,"CP","Acceptée",1,"2013/06"]
["GUINOT Nathalie","2013-06-05","2013-06-12",0,"2013-06-12",0,"CP","Acceptée",1,"2013/06"]
["GUINOT Nathalie","2013-06-05","2013-06-19",0,"2013-06-19",0,"CP","Acceptée",1,"2013/06"]
["GUINOT Nathalie","2013-06-20","2013-07-17",0,"2013-07-17",0,"CP","Acceptée",1,"2013/07"]
["GUINOT Nathalie","2013-06-20","2013-07-02",0,"2013-07-02",0,"CP","Acceptée",1,"2013/07"]
["GUINOT Nathalie","2013-06-21","2013-08-12",0,"2013-08-30",0,"CP","Acceptée",14,"2013/08"]
["ROBIN Kevin","2013-06-20","2013-08-12",0,"2013-08-30",0,"CP","Acceptée",14,"2013/08"]
["SOUCHET Alain","2013-06-21","2013-08-05",0,"2013-08-31",0,"CP","Acceptée",19,"2013/08"]
["SOUCHET Alain","2013-06-21","2013-09-01",0,"2013-09-02",0,"CP","Acceptée",1,"2013/09"]
["SIODMAK Eric","2013-06-27","2013-08-12",0,"2013-08-31",0,"CP","Acceptée",14,"2013/08"]
["SIODMAK Eric","2013-06-27","2013-09-01",0,"2013-09-02",0,"CP","Acceptée",1,"2013/09"]
["SIODMAK Eric","2013-06-27","2013-08-09",0,"2013-08-09",0,"RTT","Acceptée",1,"2013/08"]
["KADEM Christophe","2013-06-24","2013-07-09",0,"2013-07-09",0,"RTT","Acceptée",1,"2013/07"]
["KADEM Christophe","2013-06-24","2013-07-08",0,"2013-07-08",0.5,"CP","Acceptée",0.5,"2013/07"]
["KADEM Christophe","2013-06-24","2013-07-26",0,"2013-07-31",0,"CP","Acceptée",4,"2013/07"]
["KADEM Christophe","2013-06-24","2013-08-01",0,"2013-08-18",0,"CP","Acceptée",11,"2013/08"]
["CHEVALIER Yohan","2013-06-06","2013-08-16",0,"2013-08-30",0,"CP","Acceptée",11,"2013/08"]
["MARAIS Bernard","2013-07-01","2013-09-02",0,"2013-09-06",0,"CP","Acceptée",5,"2013/09"]
["GUINOT Nathalie","2013-06-20","2013-07-10",0,"2013-07-10",0,"CP","Acceptée",1,"2013/07"]
["SANTUCCI Lionel","2013-06-26","2013-07-19",0,"2013-07-19",0,"RTT","Acceptée",1,"2013/07"]
["CHEVALIER Yohan","2013-06-26","2013-07-05",0,"2013-07-05",0,"CP","Acceptée",1,"2013/07"]
["LOYER Michel","2013-07-01","2013-07-29",0,"2013-07-31",0,"CP","Acceptée",3,"2013/07"]
["LOYER Michel","2013-07-01","2013-08-01",0,"2013-08-19",0,"CP","Acceptée",12,"2013/08"]
["GUERIN Viviane","2013-06-01","2013-06-03",0,"2013-06-03",0,"CP","Acceptée",1,"2013/06"]
["GUERIN Viviane","2013-07-01","2013-07-12",0,"2013-07-12",0,"CP","Acceptée",1,"2013/07"]
["GUERIN Viviane","2013-07-01","2013-07-26",0,"2013-07-26",0,"CP","Acceptée",1,"2013/07"]
["HAUTEBRANC Alexis","2013-06-24","2013-07-05",0,"2013-07-05",0,"RTT","Acceptée",1,"2013/07"]
["DREVON Alain","2013-06-25","2013-09-01",0,"2013-09-06",0,"CP","Acceptée",5,"2013/09"]
["HAUTEBRANC Alexis","2013-07-01","2013-07-29",0,"2013-07-31",0,"CP","Acceptée",3,"2013/07"]
["HAUTEBRANC Alexis","2013-07-01","2013-08-01",0,"2013-08-09",0,"CP","Acceptée",7,"2013/08"]
["HAUTEBRANC Alexis","2013-07-01","2013-08-14",0,"2013-08-16",0,"CP","Acceptée",2,"2013/08"]
["BELBEY Dounia","2013-07-01","2013-07-02",0,"2013-07-02",0.5,"RTT","Acceptée",0.5,"2013/07"]
["DEREPPE Bruno","2013-04-16","2013-09-02",0,"2013-09-06",0,"CP","Acceptée",5,"2013/09"]
["COUTANT Jean Paul","2013-07-01","2013-08-12",0,"2013-08-31",0,"CP","Acceptée",14,"2013/08"]
["COUTANT Jean Paul","2013-07-01","2013-09-01",0,"2013-09-02",0,"CP","Acceptée",1,"2013/09"]
["LAZZARO Fabien","2013-07-01","2013-07-26",0,"2013-07-31",0,"CP","Acceptée",4,"2013/07"]
["LAZZARO Fabien","2013-07-01","2013-08-01",0,"2013-08-09",0,"CP","Acceptée",7,"2013/08"]
["LAZZARO Fabien","2013-07-01","2013-09-02",0,"2013-09-09",0,"CP","Acceptée",6,"2013/09"]
["GIRAUDON Alain","2013-07-01","2013-08-05",0,"2013-08-31",0,"CP","Acceptée",19,"2013/08"]
["LIOGIER Serge","2013-07-01","2013-07-29",0,"2013-07-31",0,"CP","Acceptée",3,"2013/07"]
["LIOGIER Serge","2013-07-01","2013-08-01",0,"2013-08-19",0,"CP","Acceptée",12,"2013/08"]
["BELBEY Dounia","2013-07-01","2013-08-08",0,"2013-08-31",0,"CP","Acceptée",16,"2013/08"]
["GUERIN Viviane","2013-07-01","2013-08-12",0,"2013-08-31",0,"CP","Acceptée",14,"2013/08"]
["GUIOT Fabien","2013-06-12","2013-06-14",0,"2013-06-17",0,"CP","Acceptée",2,"2013/06"]
["GUIOT Fabien","2013-07-01","2013-08-05",0,"2013-08-23",0,"CP","Acceptée",14,"2013/08"]
["HAUTEBRANC Alexis","2013-07-01","2013-08-26",0,"2013-08-31",0,"CP","Acceptée",5,"2013/08"]
["HAUTEBRANC Alexis","2013-07-01","2013-09-01",0,"2013-09-03",0,"CP","Acceptée",2,"2013/09"]
["VAUTRAIN Franck","2013-07-01","2013-08-01",0,"2013-08-23",0,"CP","Acceptée",16,"2013/08"]
["RUBIO Isabel","2013-06-30","2013-06-07",0,"2013-06-07",0,"CP","Acceptée",1,"2013/06"]
["RUBIO Isabel","2013-06-30","2013-06-18",0,"2013-06-18",0.5,"CP","Acceptée",0.5,"2013/06"]
["RUBIO Isabel","2013-07-01","2013-08-02",0,"2013-08-23",0,"CP","Acceptée",15,"2013/08"]
["DREZET Olivier","2013-07-03","2013-07-12",0,"2013-07-12",0,"CP","Acceptée",1,"2013/07"]
["SIODMAK Eric","2013-07-05","2013-07-11",0,"2013-07-11",0,"RTT","Acceptée",1,"2013/07"]
["HAUTCLOCQ Claude","2013-07-11","2013-07-11",0,"2013-07-11",0,"RTT","Acceptée",1,"2013/07"]
["DREZET Olivier","2013-07-23","2013-07-26",0,"2013-07-26",0,"CP","Acceptée",1,"2013/07"]
["PONS Olivier","2013-07-23","2013-07-26",0,"2013-07-26",0,"CP","Acceptée",1,"2013/07"]
["LAHAYE Laure","2013-06-24","2013-06-24",0,"2013-06-24",0,"CP","Acceptée",1,"2013/06"]
["TAQUET Alain","2013-07-26","2013-07-31",0,"2013-07-31",0,"RTT","Acceptée",1,"2013/07"]
["DREZET Olivier","2013-07-31","2013-09-02",0,"2013-09-04",0,"CP","Acceptée",3,"2013/09"]
["POMMERELL Patrick","2013-08-01","2013-08-19",0,"2013-08-23",0,"CP","Acceptée",5,"2013/08"]
["KADEM Christophe","2013-09-02","2013-10-21",0,"2013-10-21",0,"RTT","Acceptée",1,"2013/10"]
["KADEM Christophe","2013-09-02","2013-10-22",0,"2013-10-22",0,"CP","Acceptée",1,"2013/10"]
["DREZET Olivier","2013-09-05","2013-11-08",0,"2013-11-08",0,"CP","Acceptée",1,"2013/11"]
["BEARZATTO Giovanni","2013-09-09","2013-09-10",0,"2013-09-10",0,"RTT","Acceptée",1,"2013/09"]
["HAUTEBRANC Alexis","2013-09-10","2013-10-04",0,"2013-10-04",0,"RTT","Acceptée",1,"2013/10"]
["PONS Olivier","2013-08-20","2013-11-13",0,"2013-11-23",0,"CP","Refusée",0,"2013/11","semaines qui suivent BATIMAT ! "]
["PONS Olivier","2013-09-19","2013-09-23",0,"2013-09-23",0,"RTT","Acceptée",1,"2013/09"]
["DEREPPE Bruno","2013-09-19","2013-11-15",0.5,"2013-11-15",0,"RTT","Acceptée",0.5,"2013/11"]
["POMMERELL Patrick","2013-09-13","2013-09-25",0,"2013-09-25",0,"RTT","Acceptée",1,"2013/09"]
["GUIOT Fabien","2013-09-18","2013-09-19",0,"2013-09-19",0,"RTT","Acceptée",1,"2013/09"]
["GUIOT Fabien","2013-09-18","2013-09-20",0,"2013-09-20",0,"CP","Acceptée",1,"2013/09"]
["DREZET Olivier","2013-09-27","2013-09-27",0,"2013-09-27",0,"RTT","Acceptée",1,"2013/09"]
["BEARZATTO Giovanni","2013-09-27","2013-09-30",0,"2013-09-30",0.5,"RTT","Acceptée",0.5,"2013/09"]
["HEMLER Christelle","2013-10-01","2013-10-16",0,"2013-10-16",0,"RTT","Acceptée",1,"2013/10"]
["GUINOT Nathalie","2013-10-01","2013-09-27",0,"2013-09-27",0,"RTT","Acceptée",1,"2013/09"]
["POMMERELL Patrick","2013-10-01","2013-10-02",0.5,"2013-10-02",0,"RTT","Acceptée",0.5,"2013/10"]
["POMMERELL Patrick","2013-10-07","2013-10-07",0.5,"2013-10-07",0,"RTT","Acceptée",0.5,"2013/10"]
["HAUTCLOCQ Claude","2013-10-07","2013-10-29",0,"2013-10-29",0,"RTT","Acceptée",1,"2013/10"]
["HAUTCLOCQ Claude","2013-10-07","2013-10-22",0,"2013-10-22",0,"RTT","Acceptée",1,"2013/10"]
["TAQUET Alain","2013-10-07","2013-10-24",0,"2013-10-25",0,"RTT","Acceptée",2,"2013/10"]
["GUIOT Fabien","2013-02-01","2013-02-15",0,"2013-02-15",0,"RTT","Acceptée",1,"2013/02","date à préciser - info avant ce programme"]
["GUIOT Fabien","2013-10-14","2013-10-15",0,"2013-10-16",0,"RTT","Acceptée",2,"2013/10"]
["HAUTCLOCQ Claude","2013-10-09","2013-10-24",0,"2013-10-25",0,"CP","Acceptée",2,"2013/10"]
["COUTANT Jean Paul","2013-10-14","2013-10-16",0,"2013-10-16",0,"RTT","Acceptée",1,"2013/10"]
["LOCATELLI Bruno","2013-10-21","2013-10-25",0,"2013-10-25",0.5,"RTT","Acceptée",0.5,"2013/10"]
["CHEVALIER Yohan","2013-10-18","2013-11-04",0,"2013-11-04",0,"CP","Acceptée",1,"2013/11"]
["HAUTCLOCQ Claude","2013-10-18","2013-10-28",0,"2013-10-28",0,"CP","Acceptée",1,"2013/10"]
["LIOGIER Serge","2013-10-02","2013-10-31",0,"2013-10-31",0,"RTT","Acceptée",1,"2013/10"]
["LOCATELLI Bruno","2013-10-14","2013-10-16",0.5,"2013-10-16",0,"RTT","Acceptée",0.5,"2013/10"]
["DREVON Alain","2013-10-14","2013-10-31",0,"2013-10-31",0,"RTT","Acceptée",1,"2013/10"]
["LEDANT Charles","2013-10-07","2013-10-31",0,"2013-10-31",0,"RTT","Acceptée",1,"2013/10"]
["GIRAUDON Alain","2013-10-25","2013-10-31",0,"2013-10-31",0,"RTT","Acceptée",1,"2013/10"]
["GUINOT Nathalie","2013-10-24","2013-10-24",0,"2013-10-24",0.5,"RTT","Acceptée",0.5,"2013/10"]
["HEMLER Christelle","2013-10-28","2013-11-13",0,"2013-11-13",0,"RTT","Acceptée",1,"2013/11"]
["POMMERELL Patrick","2013-10-28","2013-10-29",0,"2013-10-29",0.5,"RTT","Acceptée",0.5,"2013/10"]
["LOCATELLI Bruno","2013-10-23","2013-11-22",0,"2013-11-22",0,"RTT","Acceptée",1,"2013/11"]
["LOCATELLI Bruno","2013-10-23","2013-12-12",0.5,"2013-12-12",0,"RTT","Acceptée",0.5,"2013/12"]
["DREVON Alain","2013-10-25","2013-12-06",0,"2013-12-06",0.5,"RTT","Acceptée",0.5,"2013/12"]
["DREVON Alain","2013-10-25","2013-11-15",0,"2013-11-15",0.5,"RTT","Acceptée",0.5,"2013/11"]
["DREVON Alain","2013-10-25","2013-12-20",0,"2013-12-20",0.5,"RTT","Acceptée",0.5,"2013/12"]
["LOYER Michel","2013-10-12","2013-10-22",0,"2013-10-25",0,"RTT","Acceptée",4,"2013/10"]
["LOYER Michel","2013-10-12","2013-10-28",0,"2013-10-29",0,"CP","Acceptée",2,"2013/10"]
["SIODMAK Eric","2013-10-28","2013-10-30",0,"2013-10-30",0,"RTT","Acceptée",1,"2013/10"]
["GUERIN Viviane","2013-10-01","2013-11-08",0,"2013-11-08",0,"RTD Recup","Acceptée",1,"2013/11"]
["KADEM Christophe","2013-11-12","2013-11-29",0,"2013-11-29",0,"RTT","Acceptée",1,"2013/11"]
["KADEM Christophe","2013-11-12","2013-12-09",0,"2013-12-09",0,"RTT","Acceptée",1,"2013/12"]
["GUIOT Fabien","2013-10-28","2013-10-29",0,"2013-10-29",0,"CP","Acceptée",1,"2013/10"]
["GUIOT Fabien","2013-10-28","2013-10-28",0,"2013-10-28",0,"RTT","Acceptée",1,"2013/10"]
["GUIOT Fabien","2013-10-28","2013-10-29",0,"2013-10-31",0,"Convention","Acceptée",0,"2013/10","décès du père"]
["CHEVALIER Yohan","2013-11-13","2013-12-16",0,"2013-12-16",0,"CP","Acceptée",1,"2013/12"]
["RUBIO Isabel","2013-09-01","2013-09-20",0,"2013-09-23",0,"CP","Acceptée",2,"2013/09"]
["RUBIO Isabel","2013-10-01","2013-10-25",0,"2013-10-29",0,"CP","Acceptée",3,"2013/10"]
["GUERIN Viviane","2013-09-01","2013-09-02",0,"2013-09-02",0,"RTT","Acceptée",1,"2013/09"]
["TAQUET Alain","2013-01-01","2013-01-02",0,"2013-01-02",0,"RTT","Acceptée",1,"2013/01"]
["COUTANT Jean Paul","2013-01-01","2013-01-02",0,"2013-01-03",0,"RTT","Acceptée",2,"2013/01"]
["PONS Olivier","2013-01-01","2013-01-11",0,"2013-01-11",0,"RTT","Acceptée",1,"2013/01"]
["HEMLER Christelle","2013-01-01","2013-01-02",0,"2013-01-02",0,"RTT","Acceptée",1,"2013/01"]
["PONS Olivier","2013-01-20","2013-01-21",0,"2013-01-21",0.5,"RTT","Acceptée",0.5,"2013/01"]
["LOCATELLI Bruno","2013-01-20","2013-01-25",0,"2013-01-25",0,"RTT","Acceptée",1,"2013/01"]
["RUBIO Isabel","2013-01-18","2013-01-18",0,"2013-01-18",0.5,"RTT","Acceptée",0.5,"2013/01"]
["DREZET Olivier","2013-02-15","2013-02-15",0,"2013-02-15",0,"RTT","Acceptée",1,"2013/02"]
["BEARZATTO Giovanni","2013-02-14","2013-02-14",0,"2013-02-14",0.5,"RTT","Acceptée",0.5,"2013/02"]
["VAUTRAIN Franck","2013-02-01","2013-02-01",0,"2013-02-01",0.5,"RTT","Acceptée",0.5,"2013/02"]
["RUBIO Isabel","2013-02-01","2013-02-01",0,"2013-02-01",0.5,"RTT","Acceptée",0.5,"2013/02"]
["GUIOT Fabien","2013-02-10","2013-02-11",0,"2013-02-11",0,"RTT","Acceptée",1,"2013/02"]
["RUBIO Isabel","2013-02-10","2013-02-13",0,"2013-02-13",0.5,"RTT","Acceptée",0.5,"2013/02"]
["GUINOT Nathalie","2013-02-18","2013-02-18",0,"2013-02-18",0.5,"RTT","Acceptée",0.5,"2013/02"]
["SIODMAK Eric","2013-02-22","2013-02-22",0,"2013-02-22",0,"RTT","Acceptée",1,"2013/02"]
["HAUTEBRANC Alexis","2013-02-21","2013-02-21",0,"2013-02-21",0,"RTT","Acceptée",1,"2013/02"]
["POMMERELL Patrick","2013-03-06","2013-03-06",0,"2013-03-06",0,"RTT","Acceptée",1,"2013/03"]
["LOCATELLI Bruno","2013-03-12","2013-03-12",0,"2013-03-12",0.5,"RTT","Acceptée",0.5,"2013/03"]
["LEDANT Charles","2013-03-18","2013-03-18",0,"2013-03-18",0,"RTT","Acceptée",1,"2013/03"]
["PONS Olivier","2013-03-25","2013-03-25",0,"2013-03-25",0,"RTT","Acceptée",1,"2013/03"]
["BEARZATTO Giovanni","2013-03-29","2013-03-29",0,"2013-03-29",0,"RTT","Acceptée",1,"2013/03"]
["PONS Olivier","2013-04-02","2013-04-02",0,"2013-04-02",0,"RTT","Acceptée",1,"2013/04"]
["HAUTEBRANC Alexis","2013-04-05","2013-04-05",0,"2013-04-05",0,"RTT","Acceptée",1,"2013/04"]
["DREZET Olivier","2013-04-12","2013-04-12",0,"2013-04-12",0,"RTT","Acceptée",1,"2013/04"]
["DEREPPE Bruno","2013-04-10","2013-04-10",0,"2013-04-10",0,"RTT","Acceptée",1,"2013/04"]
["LOYER Michel","2013-04-17","2013-04-17",0,"2013-04-17",0,"RTT","Acceptée",1,"2013/04"]
["HAUTCLOCQ Claude","2013-04-26","2013-04-26",0,"2013-04-26",0,"RTT","Acceptée",1,"2013/04"]
["LEDANT Charles","2013-04-26","2013-04-26",0,"2013-04-26",0,"RTT","Acceptée",1,"2013/04"]
["KADEM Christophe","2013-05-02","2013-05-02",0,"2013-05-02",0,"RTT","Acceptée",1,"2013/05"]
["LAZZARO Fabien","2013-05-02","2013-05-02",0,"2013-05-02",0,"RTT","Acceptée",1,"2013/05"]
["LIOGIER Serge","2013-05-07","2013-05-07",0,"2013-05-07",0,"RTT","Acceptée",1,"2013/05"]
["GIRAUDON Alain","2013-05-06","2013-05-06",0,"2013-05-06",0,"RTT","Acceptée",1,"2013/05"]
["LEDANT Charles","2013-05-17","2013-05-17",0,"2013-05-17",0,"RTT","Acceptée",1,"2013/05"]
["RUBIO Isabel","2013-05-24","2013-05-24",0,"2013-05-24",0,"RTT","Acceptée",1,"2013/05"]
["SIODMAK Eric","2013-05-28","2013-05-28",0,"2013-05-28",0,"RTT","Acceptée",1,"2013/05"]
["LIOGIER Serge","2013-10-02","2013-10-31",0,"2013-10-31",0,"RTT","Acceptée",1,"2013/10"]
["DREVON Alain","2013-10-02","2013-10-31",0,"2013-10-31",0,"RTT","Acceptée",1,"2013/10"]
["LEDANT Charles","2013-10-02","2013-10-31",0,"2013-10-31",0,"RTT","Acceptée",1,"2013/10"]
["DREZET Olivier","2013-10-30","2013-10-31",0,"2013-10-31",0,"RTT","Acceptée",1,"2013/10"]
["POMMERELL Patrick","2013-11-13","2013-11-15",0.5,"2013-11-15",0,"CP","Acceptée",0.5,"2013/11"]
["COUTANT Jean Paul","2013-11-13","2013-11-13",0,"2013-11-13",0,"RTT","Acceptée",1,"2013/11"]
["SANTUCCI Lionel","2013-11-25","2013-11-27",0,"2013-11-27",0,"RTT","Acceptée",1,"2013/11"]
["VAUTRAIN Franck","2013-11-25","2013-11-26",0,"2013-11-26",0,"RTT","Acceptée",1,"2013/11"]
["LOCATELLI Bruno","2013-11-05","2013-11-28",0,"2013-11-28",0,"RTT","Acceptée",1,"2013/11"]
["LEDANT Charles","2013-11-13","2013-11-29",0,"2013-11-29",0,"RTT","Acceptée",1,"2013/11"]
["POMMERELL Patrick","2013-11-27","2013-11-27",0,"2013-11-27",0.5,"RTT","Acceptée",0.5,"2013/11"]
["HEMLER Christelle","2013-11-27","2013-12-09",0,"2013-12-09",0,"RTT","Acceptée",1,"2013/12"]
["HEMLER Christelle","2013-11-27","2013-12-11",0,"2013-12-11",0,"RTT","Acceptée",1,"2013/12"]
["HEMLER Christelle","2013-11-27","2013-12-16",0,"2013-12-16",0,"RTT","Acceptée",1,"2013/12"]
["HEMLER Christelle","2013-11-27","2013-12-23",0,"2013-12-23",0,"RTT","Acceptée",1,"2013/12"]
["HEMLER Christelle","2013-11-27","2014-01-06",0,"2014-01-06",0,"RTT","Acceptée",1,"2014/01","solde 2013"]
["HAUTCLOCQ Claude","2013-11-29","2013-12-31",0,"2013-12-31",0,"RTT","Acceptée",1,"2013/12"]
["HAUTCLOCQ Claude","2013-11-04","2013-12-24",0,"2013-12-27",0,"CP","Acceptée",3,"2013/12"]
["GUERIN Viviane","2013-11-27","2013-12-24",0,"2013-12-26",0,"RTT","Acceptée",2,"2013/12"]
["LOCATELLI Bruno","2013-10-21","2013-12-24",0,"2013-12-26",0,"RTT","Acceptée",2,"2013/12"]
["LOCATELLI Bruno","2013-12-12","2013-12-12",0,"2013-12-12",0.5,"CP","Acceptée",0.5,"2013/12"]
["PLONQUET Christian","2013-11-18","2013-12-24",0,"2013-12-24",0,null,"Acceptée",1,"2013/12","a recuperer"]
["MARAIS Bernard","2013-11-14","2013-12-26",0,"2013-12-27",0,"CP","Acceptée",2,"2013/12"]
["HAUTEBRANC Alexis","2013-10-14","2013-12-26",0,"2013-12-26",0,"RTT","Acceptée",1,"2013/12"]
["HAUTEBRANC Alexis","2013-11-08","2013-11-08",0,"2013-11-08",0,"RTT","Acceptée",1,"2013/11"]
["HAUTEBRANC Alexis","2013-11-08","2013-11-15",0,"2013-11-15",0,"RTT","Acceptée",1,"2013/11"]
["HAUTEBRANC Alexis","2013-10-14","2013-12-27",0,"2013-12-27",0,"RTT","Acceptée",1,"2013/12"]
["SANTUCCI Lionel","2013-11-08","2013-12-31",0,"2013-12-31",0,"RTT","Acceptée",1,"2013/12"]
["SANTUCCI Lionel","2013-11-08","2014-01-02",0,"2014-01-03",0,"RTT","Acceptée",2,"2014/01"]
["LEDANT Charles","2013-10-15","2013-12-24",0,"2013-12-24",0,"RTT","Acceptée",1,"2013/12"]
["LEDANT Charles","2013-10-15","2013-12-27",0,"2013-12-27",0,"RTT","Acceptée",1,"2013/12"]
["LEDANT Charles","2013-10-15","2013-12-31",0,"2013-12-31",0,"CP","Acceptée",1,"2013/12"]
["LEDANT Charles","2013-10-15","2014-01-02",0,"2014-01-02",0,"CP","Acceptée",1,"2014/01"]
["MINAKIAN Mathilde","2013-11-27","2013-12-26",0,"2013-12-27",0,"CP","Acceptée",2,"2013/12"]
["DREVON Alain","2013-10-25","2014-01-02",0,"2014-01-03",0,"RTT","Acceptée",2,"2014/01"]
["LAZZARO Fabien","2013-09-18","2013-12-24",0,"2013-12-27",0,"RTT","Acceptée",3,"2013/12"]
["PONS Olivier","2013-11-27","2013-12-26",0,"2013-12-27",0,"RTT","Acceptée",2,"2013/12"]
["DREZET Olivier","2013-11-26","2014-01-02",0,"2014-01-02",0,"RTT","Acceptée",1,"2014/01"]
["DREZET Olivier","2013-11-26","2013-12-23",0,"2013-12-24",0,"RTT","Acceptée",2,"2013/12"]
["ROBIN Kevin","2013-11-29","2014-01-02",0,"2014-01-02",0,"CP","Acceptée",1,"2014/01","le 3 est en réciup"]
["GIRAUDON Alain","2013-11-19","2013-12-26",0,"2013-12-27",0,"RTT","Acceptée",2,"2013/12"]
["GUINOT Nathalie","2013-11-14","2014-01-02",0,"2014-01-03",0,"RTT","Acceptée",2,"2014/01"]
["KADEM Christophe","2013-11-12","2013-12-26",0,"2013-12-26",0,"RTT","Acceptée",1,"2013/12"]
["KADEM Christophe","2013-11-12","2013-12-31",0,"2013-12-31",0,"RTT","Acceptée",1,"2013/12"]
["SOUCHET Alain","2013-10-31","2013-12-30",0,"2013-12-31",0,"RTT","Acceptée",2,"2013/12"]
["TAQUET Alain","2013-10-15","2013-12-30",0,"2013-12-31",0,"RTT","Acceptée",2,"2013/12"]
["DEREPPE Bruno","2013-11-29","2013-12-24",0,"2013-12-27",0,"RTT","Acceptée",3,"2013/12","Accord spécifique"]
["BEARZATTO Giovanni","2013-11-29","2013-12-31",0,"2013-12-31",0,"RTT","Acceptée",1,"2013/12"]
["BEARZATTO Giovanni","2013-11-29","2014-01-02",0,"2014-01-02",0,"RTT","Acceptée",1,"2014/01"]
["POMMERELL Patrick","2013-11-29","2013-12-23",0,"2013-12-24",0,"RTT","Acceptée",2,"2013/12"]
["CHEVALIER Yohan","2013-11-08","2013-12-26",0,"2013-12-27",0,"CP","Acceptée",2,"2013/12"]
["SIODMAK Eric","2013-12-02","2014-01-02",0,"2014-01-03",0,"RTT","Acceptée",2,"2014/01"]
["COUTANT Jean Paul","2013-12-04","2013-12-31",0,"2013-12-31",0,"RTT","Acceptée",1,"2013/12"]
["COUTANT Jean Paul","2013-12-04","2013-12-05",0,"2013-12-05",0.5,"RTT","Acceptée",0.5,"2013/12"]
["GIRAUDON Alain","2013-11-19","2014-04-07",0,"2014-04-11",0,"CP","Acceptée",5,"2014/04"]
["GIRAUDON Alain","2013-11-19","2014-04-14",0,"2014-04-14",0,"RTT","Acceptée",1,"2014/04"]
["LOYER Michel","2013-12-06","2013-12-26",0,"2013-12-27",0,"RTT","Acceptée",2,"2013/12"]
["GUIOT Fabien","2013-12-11","2014-01-02",0,"2014-01-03",0,"RTT","Acceptée",2,"2014/01"]
["HAUTCLOCQ Claude","2013-12-06","2014-01-02",0,"2014-01-03",0,"CP","Acceptée",2,"2014/01"]
["MARZOUK Sami","2013-12-13","2013-12-23",0,"2013-12-24",0,"RTT","Acceptée",2,"2013/12"]
["VAUTRAIN Franck","2013-12-18","2014-01-09",0,"2014-01-09",0,"CP","Acceptée",1,"2014/01"]
["VAUTRAIN Franck","2013-12-23","2013-12-30",0,"2013-12-31",0,"RTT","Acceptée",2,"2013/12"]
["VAUTRAIN Franck","2013-12-23","2014-01-01",0,"2014-01-02",0,"RTT","Acceptée",1,"2014/01"]
["GIRAUDON Alain","2013-12-28","2014-01-02",0,"2014-01-02",0,"RTT","Acceptée",1,"2014/01"]
["POMMERELL Patrick","2013-12-23","2013-12-23",0,"2013-12-24",0,"CP","Acceptée",2,"2013/12"]
["GUERIN Viviane","2013-06-25","2013-06-27",0,"2013-06-27",0.5,"RTD Recup","Acceptée",0.5,"2013/06"]
["HAUTCLOCQ Claude","2014-01-06","2014-01-10",0,"2014-01-10",0,"CP","Acceptée",1,"2014/01"]
["PONS Olivier","2014-01-07","2014-01-31",0,"2014-01-31",0,"RTT","Acceptée",1,"2014/01"]
["LOCATELLI Bruno","2014-01-13","2014-01-15",0.5,"2014-01-15",0,"CP","Acceptée",0.5,"2014/01"]
["LOCATELLI Bruno","2014-01-09","2014-01-17",0,"2014-01-17",0,"CP","Acceptée",1,"2014/01"]
["DREVON Alain","2014-01-09","2014-01-17",0,"2014-01-17",0.5,"RTT","Acceptée",0.5,"2014/01"]
["DREVON Alain","2014-01-09","2014-02-20",0,"2014-02-21",0,"CP","Acceptée",2,"2014/02"]
["DREVON Alain","2014-01-09","2014-03-03",0,"2014-03-07",0,"CP","Acceptée",5,"2014/03"]
["DREVON Alain","2014-01-09","2014-05-05",0,"2014-05-07",0,"CP","Acceptée",3,"2014/05"]
["LEDANT Charles","2014-01-13","2014-04-28",0,"2014-04-30",0,"CP","Acceptée",3,"2014/04"]
["LEDANT Charles","2014-01-13","2014-05-01",0,"2014-05-02",0,"CP","Acceptée",1,"2014/05"]
["HAUTEBRANC Alexis","2014-01-06","2014-05-27",0,"2014-05-30",0,"CP","Acceptée",3,"2014/05","regroupement de 2 demandes"]
["BERTHE Magali","2014-01-09","2014-04-28",0,"2014-04-30",0,"CP","Acceptée",3,"2014/04","acceptées à l'embauche"]
["BERTHE Magali","2014-01-09","2014-05-01",0,"2014-05-09",0,"CP","Acceptée",5,"2014/05","acceptées à l'embauche"]
["LOCATELLI Bruno","2013-10-21","2014-03-17",0,"2014-03-21",0,"CP","Acceptée",5,"2014/03"]
["LAZZARO Fabien","2014-01-06","2014-04-22",0,"2014-04-25",0,"CP","Acceptée",4,"2014/04"]
["LAZZARO Fabien","2014-01-06","2014-04-28",0,"2014-04-30",0,"Convention","Acceptée",0,"2014/04","MARIAGE (3j)"]
["LAZZARO Fabien","2014-01-06","2014-05-01",0,"2014-05-02",0,"Convention","Acceptée",0,"2014/05","MARIAGE (1j)"]
["LAZZARO Fabien","2014-01-06","2014-05-05",0,"2014-05-09",0,"CP","Acceptée",4,"2014/05"]
["COUTANT Jean Paul","2014-01-24","2014-02-26",0,"2014-02-28",0,"CP","Acceptée",3,"2014/02"]
["GUERIN Viviane","2014-01-23","2014-02-07",0,"2014-02-07",0,"RTT","Acceptée",1,"2014/02","Solde 2013"]
["GUERIN Viviane","2014-01-23","2014-03-10",0,"2014-03-10",0,"RTD Recup","Acceptée",1,"2014/03","artd 2013"]
["GUERIN Viviane","2014-01-23","2014-02-28",0,"2014-02-28",0,"RTD Recup","Acceptée",1,"2014/02","artd 2013"]
["TAQUET Alain","2014-02-07","2014-03-03",0,"2014-03-04",0,"RTT","Acceptée",2,"2014/03","solde 2013"]
["HAUTEBRANC Alexis","2014-02-04","2014-05-26",0,"2014-05-26",0,"CP","Acceptée",1,"2014/05"]
["GUERIN Viviane","2014-02-03","2014-04-04",0,"2014-04-07",0,"RTD Recup","Acceptée",2,"2014/04","artd 2013"]
["GUERIN Viviane","2014-02-03","2014-05-05",0,"2014-05-07",0,"CP","Acceptée",3,"2014/05"]
["HAUTEBRANC Alexis","2014-01-13","2014-02-21",0,"2014-02-21",0,"RTT","Acceptée",1,"2014/02"]
["GUERIN Viviane","2014-02-03","2014-05-02",0,"2014-05-02",0,"CP","Acceptée",1,"2014/05"]
["GUIOT Fabien","2014-02-11","2014-02-21",0,"2014-02-21",0,"RTT","Acceptée",1,"2014/02"]
["GUIOT Fabien","2014-02-12","2014-02-24",0,"2014-02-25",0,"CP","Acceptée",2,"2014/02"]
["GUIOT Fabien","2014-02-12","2014-04-14",0,"2014-04-18",0,"CP","Acceptée",5,"2014/04"]
["LOYER Michel","2014-02-17","2014-02-26",0,"2014-02-28",0,"CP","Acceptée",3,"2014/02"]
["DEREPPE Bruno","2014-02-17","2014-02-25",0,"2014-02-25",0,"RTT","Acceptée",1,"2014/02"]
["POMMERELL Patrick","2014-02-19","2014-02-21",0,"2014-02-21",0.5,"RTT","Acceptée",0.5,"2014/02"]
["SIODMAK Eric","2014-02-20","2014-04-22",0,"2014-04-25",0,"CP","Acceptée",4,"2014/04"]
["SIODMAK Eric","2014-02-20","2014-02-24",0.5,"2014-02-24",0,"RTT","Acceptée",0.5,"2014/02"]
["SIODMAK Eric","2014-02-20","2014-03-03",0,"2014-03-07",0,"CP","Acceptée",5,"2014/03"]
["KADEM Christophe","2014-02-17","2014-03-10",0,"2014-03-14",0,"CP","Acceptée",5,"2014/03"]
["KADEM Christophe","2014-02-27","2014-04-22",0,"2014-04-25",0,"CP","Acceptée",4,"2014/04"]
["BETRY Aymeric","2014-02-21","2014-02-21",0,"2014-02-21",0,"CP","Acceptée",1,"2014/02","accord par anticipation - malade"]
["BEARZATTO Giovanni","2014-01-24","2014-02-03",0,"2014-02-07",0,"CP","Acceptée",5,"2014/02"]
["LEDANT Charles","2014-02-14","2014-02-28",0,"2014-02-28",0,"CP","Acceptée",1,"2014/02"]
["LEDANT Charles","2014-02-14","2014-03-24",0,"2014-03-24",0,"CP","Acceptée",1,"2014/03"]
["LEDANT Charles","2014-02-14","2014-04-18",0,"2014-04-18",0,"CP","Acceptée",1,"2014/04"]
["LEDANT Charles","2014-02-14","2014-05-09",0,"2014-05-09",0,"CP","Acceptée",1,"2014/05"]
["GIRAUDON Alain","2014-02-18","2014-02-18",0,"2014-02-18",0.5,"RTT","Acceptée",0.5,"2014/02"]
["TAQUET Alain","2014-02-21","2014-03-05",0,"2014-03-06",0,"CP","Acceptée",2,"2014/03"]
["TAQUET Alain","2014-02-21","2014-04-28",0,"2014-04-30",0,"CP","Acceptée",3,"2014/04"]
["TAQUET Alain","2014-02-21","2014-03-07",0,"2014-03-07",0,"RTD Recup","Acceptée",1,"2014/03","ARTD 2013"]
["TAQUET Alain","2014-02-21","2014-05-02",0,"2014-05-02",0,"RTD Recup","Acceptée",1,"2014/05","ARTD 2013"]
["LAZZARO Fabien","2014-02-20","2014-03-03",0,"2014-03-03",0,"RTT","Acceptée",1,"2014/03"]
["DREZET Olivier","2014-03-03","2014-03-17",0,"2014-03-17",0,"RTT","Acceptée",1,"2014/03"]
["HEMLER Christelle","2014-03-03","2014-03-06",0,"2014-03-06",0,"CP","Acceptée",1,"2014/03"]
["HEMLER Christelle","2014-03-03","2014-03-19",0,"2014-03-19",0,"CP","Acceptée",1,"2014/03"]
["LAZZARO Fabien","2014-02-26","2014-03-24",0,"2014-03-24",0,"RTD Recup","Acceptée",1,"2014/03","ARTD 2013"]
["GUERIN Viviane","2014-03-03","2014-03-21",0,"2014-03-21",0.5,"RTD Recup","Acceptée",0.5,"2014/03","artd 2013"]
["GUERIN Viviane","2014-03-03","2014-07-11",0,"2014-07-11",0.5,"RTD Recup","Acceptée",0.5,"2014/07","artd 2013"]
["GUERIN Viviane","2014-03-03","2014-03-31",0,"2014-03-31",0,"CP","Acceptée",1,"2014/03"]
["GUERIN Viviane","2014-03-03","2014-05-09",0,"2014-05-09",0,"RTT","Acceptée",1,"2014/05"]
["LOCATELLI Bruno","2014-03-03","2014-04-07",0,"2014-04-07",0,"CP","Acceptée",1,"2014/04"]
["SANTUCCI Lionel","2014-10-29","2013-10-29",0.5,"2013-10-31",0,"CP","Acceptée",2.5,"2013/10"]
["SANTUCCI Lionel","2014-03-03","2014-03-07",0,"2014-03-07",0,"CP","Acceptée",1,"2014/03"]
["MARAIS Bernard","2014-01-28","2014-05-30",0,"2014-05-30",0,"CP","Acceptée",1,"2014/05"]
["LOCATELLI Bruno","2014-02-25","2014-03-14",0,"2014-03-14",0,"CP","Acceptée",1,"2014/03"]
["MARAIS Bernard","2014-01-02","2014-05-02",0,"2014-05-09",0,"CP","Acceptée",5,"2014/05"]
["MARAIS Bernard","2014-01-28","2014-05-30",0,"2014-05-30",0,"CP","Acceptée",1,"2014/05"]
["LOYER Michel","2014-03-07","2014-04-28",0,"2014-05-02",0,"CP","Acceptée",4,"2014/05"]
["GUERIN Viviane","2014-03-03","2014-05-30",0,"2014-05-30",0,"CP","Acceptée",1,"2014/05"]
["BEARZATTO Giovanni","2014-03-14","2014-05-26",0,"2014-05-30",0,"CP","Acceptée",4,"2014/05"]
["MARZOUK Sami","2014-03-14","2014-03-17",0,"2014-03-21",0,"CP","Acceptée",5,"2014/03"]
["MARAIS Bernard","2014-03-17","2014-04-17",0,"2014-04-18",0,"CP","Acceptée",2,"2014/04"]
["COUTANT Jean Paul","2014-03-18","2014-04-22",0,"2014-04-25",0,"CP","Acceptée",4,"2014/04"]
["SOUCHET Alain","2014-03-18","2014-05-12",0,"2014-05-16",0,"CP","Acceptée",5,"2014/05"]
["POMMERELL Patrick","2014-03-17","2014-03-18",0,"2014-03-18",0,"CP","Acceptée",1,"2014/03"]
["POMMERELL Patrick","2014-03-17","2014-05-19",0,"2014-05-23",0,"CP","Acceptée",5,"2014/05"]
["SOUCHET Alain","2014-03-19","2014-05-02",0,"2014-05-02",0,"CP","Acceptée",1,"2014/05"]
["SOUCHET Alain","2014-03-19","2014-05-09",0,"2014-05-09",0,"CP","Acceptée",1,"2014/05"]
["SOUCHET Alain","2014-03-19","2014-05-30",0,"2014-05-30",0,"CP","Acceptée",1,"2014/05"]
["BEARZATTO Giovanni","2014-03-19","2014-04-04",0,"2014-04-04",0,"CP","Acceptée",1,"2014/04"]
["POMMERELL Patrick","2014-03-24","2014-04-11",0,"2014-04-11",0,"CP","Acceptée",1,"2014/04"]
["POMMERELL Patrick","2014-03-24","2014-04-22",0,"2014-04-25",0,"CP","Acceptée",4,"2014/04"]
["GUIOT Fabien","2014-03-24","2014-03-27",0,"2014-03-27",0,"CP","Acceptée",1,"2014/03"]
["HEMLER Christelle","2014-03-24","2014-03-26",0,"2014-03-26",0,"CP","Acceptée",1,"2014/03"]
["PONS Olivier","2014-03-24","2014-04-03",0,"2014-04-04",0,"CP","Acceptée",2,"2014/04"]
["GUERIN Viviane","2014-03-21","2014-04-30",0,"2014-04-30",0,"CP","Acceptée",1,"2014/04"]
["LOYER Michel","2014-03-26","2014-03-31",0,"2014-03-31",0,"CP","Acceptée",1,"2014/03"]
["GUINOT Nathalie","2014-03-31","2014-04-22",0,"2014-04-25",0,"CP","Acceptée",4,"2014/04"]
["CHEVALIER Yohan","2014-03-28","2014-04-07",0,"2014-04-09",0,"CP","Acceptée",3,"2014/04"]
["DEREPPE Bruno","2014-04-01","2014-04-14",0,"2014-04-18",0,"CP","Acceptée",5,"2014/04"]
["TAQUET Alain","2014-03-28","2014-05-09",0,"2014-05-09",0,"CP","Acceptée",1,"2014/05"]
["TAQUET Alain","2014-03-28","2014-05-26",0,"2014-05-30",0,"CP","Acceptée",4,"2014/05"]
["VAUTRAIN Franck","2014-04-07","2014-04-11",0,"2014-04-11",0,"RTT","Acceptée",1,"2014/04"]
["LOCATELLI Bruno","2014-03-31","2014-04-22",0,"2014-04-22",0,"RTT","Acceptée",1,"2014/04"]
["LOCATELLI Bruno","2014-03-28","2014-05-02",0,"2014-05-02",0,"CP","Acceptée",1,"2014/05","Accord congés antipés sur 2014/2015"]
["LOCATELLI Bruno","2014-03-28","2014-05-09",0,"2014-05-09",0,"CP","Acceptée",1,"2014/05","Accord congés antipés sur 2014/2015"]
["LOCATELLI Bruno","2014-03-28","2014-05-26",0,"2014-05-26",0,"CP","Acceptée",1,"2014/05","demande d'origine du 26 au 30/05. modif mail"]
["VAUTRAIN Franck","2014-03-27","2014-05-02",0,"2014-05-09",0,"CP","Acceptée",5,"2014/05"]
["VAUTRAIN Franck","2014-03-27","2014-05-30",0,"2014-05-30",0,"CP","Acceptée",1,"2014/05"]
["VAUTRAIN Franck","2014-03-27","2014-04-18",0,"2014-04-22",0,"CP","Acceptée",2,"2014/04"]
["PONS Olivier","2014-04-02","2014-04-11",0,"2014-04-11",0,"CP","Acceptée",1,"2014/04"]
["PLONQUET Christian","2014-04-07","2014-04-22",0,"2014-04-30",0,"Convention","Acceptée",0,"2014/04","Recup 5j"]
["LOCATELLI Bruno","2014-03-28","2014-06-02",0,"2014-06-02",0,"RTT","Acceptée",1,"2014/06"]
["VAUTRAIN Franck","2014-04-07","2014-04-11",0,"2014-04-11",0.5,"RTT","Acceptée",0.5,"2014/04"]
["COUTANT Jean Paul","2013-12-31","2014-01-02",0,"2014-01-03",0,"CP","Acceptée",2,"2014/01"]
["POMMERELL Patrick","2014-04-09","2014-04-09",0,"2014-04-09",0,"RTT","Acceptée",1,"2014/04"]
["LOYER Michel","2014-04-11","2014-04-14",0,"2014-04-14",0,"CP","Acceptée",1,"2014/04"]
["ROBIN Kevin","2014-04-11","2014-05-02",0,"2014-05-02",0,"CP","Acceptée",1,"2014/05"]
["ROBIN Kevin","2014-04-11","2014-05-09",0,"2014-05-09",0,"CP","Acceptée",1,"2014/05"]
["ROBIN Kevin","2014-04-11","2014-05-30",0,"2014-05-30",0,"CP","Acceptée",1,"2014/05"]
["COUTANT Jean Paul","2014-04-14","2014-05-02",0,"2014-05-02",0,"CP","Acceptée",1,"2014/05"]
["COUTANT Jean Paul","2014-04-14","2014-05-09",0,"2014-05-09",0,"CP","Acceptée",1,"2014/05"]
["COUTANT Jean Paul","2014-04-14","2014-05-21",0,"2014-05-21",0,"CP","Acceptée",1,"2014/05"]
["COUTANT Jean Paul","2014-04-14","2014-05-30",0,"2014-05-30",0,"CP","Acceptée",1,"2014/05"]
["DREVON Alain","2014-01-09","2014-05-02",0,"2014-05-02",0,"RTT","Acceptée",1,"2014/05"]
["DREVON Alain","2014-01-09","2014-05-09",0,"2014-05-09",0,"RTT","Acceptée",1,"2014/05"]
["DREVON Alain","2014-01-09","2014-05-30",0,"2014-05-30",0,"RTT","Acceptée",1,"2014/05"]
["LEDANT Charles","2014-02-07","2014-05-30",0,"2014-05-30",0,"RTT","Acceptée",1,"2014/05"]
["SANTUCCI Lionel","2014-04-11","2014-05-05",0,"2014-05-09",0,"CP","Acceptée",4,"2014/05"]
["BEARZATTO Giovanni","2014-04-14","2014-05-02",0,"2014-05-02",0,"CP","Acceptée",1,"2014/05"]
["BEARZATTO Giovanni","2014-04-14","2014-05-09",0,"2014-05-09",0,"CP","Acceptée",1,"2014/05"]
["LOCATELLI Bruno","2014-04-23","2014-05-30",0,"2014-05-30",0,"CP","Acceptée",1,"2014/05","demande d'origine du 26 au 30/05. modif mail"]
["LOCATELLI Bruno","2014-04-23","2014-05-22",0,"2014-05-23",0,"CP","Acceptée",2,"2014/05","demande d'origine du 26 au 30/05. modif mail"]
["PONS Olivier","2014-04-23","2014-04-30",0,"2014-04-30",0,"CP","Acceptée",1,"2014/04","accord tel du 23/04/2014"]
["PONS Olivier","2014-04-23","2014-05-02",0,"2014-05-05",0,"CP","Acceptée",2,"2014/05","accord tel du 23/04/2014"]
["PONS Olivier","2014-04-23","2014-05-09",0,"2014-05-09",0,"CP","Acceptée",1,"2014/05","accord tel du 23/04/2014"]
["PONS Olivier","2014-04-23","2014-05-30",0,"2014-05-30",0,"CP","Acceptée",1,"2014/05","accord tel du 23/04/2014"]
["GIRAUDON Alain","2014-04-23","2014-05-30",0,"2014-05-30",0,"CP","Acceptée",1,"2014/05"]
["GIRAUDON Alain","2014-04-23","2014-05-02",0,"2014-05-02",0,"RTT","Acceptée",1,"2014/05"]
["GIRAUDON Alain","2014-04-23","2014-05-09",0,"2014-05-09",0,"RTT","Acceptée",1,"2014/05"]
["SANTUCCI Lionel","2014-04-24","2014-04-29",0,"2014-04-30",0,"CP","Acceptée",2,"2014/04"]
["SANTUCCI Lionel","2014-04-24","2014-05-02",0,"2014-05-02",0,"CP","Acceptée",1,"2014/05"]
["SANTUCCI Lionel","2014-04-24","2014-05-12",0,"2014-05-13",0,"CP","Acceptée",2,"2014/05"]
["SANTUCCI Lionel","2014-05-24","2014-05-26",0,"2014-05-26",0,"CP","Acceptée",1,"2014/05"]
["DREZET Olivier","2014-04-25","2014-05-12",0,"2014-05-12",0,"CP","Acceptée",1,"2014/05"]
["DREZET Olivier","2014-04-25","2014-05-02",0,"2014-05-02",0,"CP","Acceptée",1,"2014/05"]
["DREZET Olivier","2014-04-28","2014-05-26",0,"2014-05-30",0,"CP","Acceptée",4,"2014/05"]
["DREZET Olivier","2014-04-28","2014-05-09",0,"2014-05-09",0,"CP","Acceptée",1,"2014/05"]
["DREZET Olivier","2014-04-28","2014-05-05",0,"2014-05-05",0,"CP","Acceptée",1,"2014/05"]
["MINAKIAN Mathilde","2014-04-23","2014-05-09",0,"2014-05-09",0,"CP","Acceptée",1,"2014/05"]
["MINAKIAN Mathilde","2014-04-23","2014-05-30",0,"2014-05-30",0,"CP","Acceptée",1,"2014/05"]
["HAUTEBRANC Alexis","2014-04-30","2014-05-02",0,"2014-05-02",0,"CP","Acceptée",1,"2014/05"]
["HAUTEBRANC Alexis","2014-04-30","2014-05-09",0,"2014-05-09",0,"CP","Acceptée",1,"2014/05"]
["KADEM Christophe","2014-05-05","2014-05-22",0,"2014-05-22",0,"RTT","Acceptée",1,"2014/05"]
["DEREPPE Bruno","2014-05-05","2014-05-09",0,"2014-05-09",0,"RTT","Acceptée",1,"2014/05"]
["DEREPPE Bruno","2014-05-05","2014-05-30",0,"2014-05-30",0,"RTT","Acceptée",1,"2014/05"]
["CHEVALIER Yohan","2014-05-05","2014-05-09",0,"2014-05-09",0,"CP","Acceptée",1,"2014/05"]
["MARZOUK Sami","2014-05-05","2014-05-02",0,"2014-05-02",0,"RTT","Acceptée",1,"2014/05"]
["MARZOUK Sami","2014-05-05","2014-05-09",0,"2014-05-09",0,"RTT","Acceptée",1,"2014/05"]
["POMMERELL Patrick","2014-05-13","2014-05-26",0,"2014-05-26",0,"CP","Acceptée",1,"2014/05","0,5 anticipé sur 2014-2015 accord"]
["POMMERELL Patrick","2014-05-13","2014-05-14",0,"2014-05-14",0,"RTT","Acceptée",1,"2014/05"]
["BEARZATTO Giovanni","2014-05-13","2014-05-13",0,"2014-05-13",0,"RTT","Acceptée",1,"2014/05"]
["HEMLER Christelle","2014-04-28","2014-04-28",0.5,"2014-04-28",0,"RTT","Acceptée",0.5,"2014/04"]
["HEMLER Christelle","2014-04-29","2014-04-29",0,"2014-04-30",0,"CP","Acceptée",2,"2014/04","suite TS"]
["HEMLER Christelle","2014-04-29","2014-05-02",0,"2014-05-09",0,"CP","Acceptée",5,"2014/05","suite TS"]
["CHEVALIER Yohan","2014-05-06","2014-05-30",0,"2014-05-30",0,"CP","Acceptée",1,"2014/05"]
["GUINOT Nathalie","2014-02-24","2014-02-24",0,"2014-02-28",0,"CP","Acceptée",5,"2014/02"]
["GUINOT Nathalie","2014-05-06","2014-05-09",0,"2014-05-09",0,"CP","Acceptée",1,"2014/05"]
["GUINOT Nathalie","2014-05-19","2014-05-28",0,"2014-05-30",0,"CP","Acceptée",2,"2014/05"]
["HAUTEBRANC Alexis","2014-05-19","2014-06-09",0,"2014-06-09",0,"RTT","Acceptée",1,"2014/06","journée solidarité"]
["HAUTEBRANC Alexis","2014-05-04","2014-06-02",0,"2014-06-02",0,"RTT","Acceptée",1,"2014/06"]
["GUERIN Viviane","2014-06-02","2014-06-02",0,"2014-06-02",0,"CP","Acceptée",1,"2014/06"]
["VAUTRAIN Franck","2014-06-02","2014-06-02",0.5,"2014-06-02",0,"RTT","Acceptée",0.5,"2014/06"]
["GUERIN Viviane","2014-05-19","2014-07-15",0,"2014-07-15",0,"CP","Acceptée",1,"2014/07","solde 2013-2014"]
["MINAKIAN Mathilde","2014-05-19","2014-07-11",0,"2014-07-11",0,"CP","Acceptée",1,"2014/07"]
["TAQUET Alain","2014-05-19","2014-06-09",0,"2014-06-09",0,"RTD Recup","Acceptée",1,"2014/06","solde 2013"]
["TAQUET Alain","2014-05-19","2014-06-10",0,"2014-06-11",0,"CP","Acceptée",2,"2014/06","solde 2013-2014"]
["GUIOT Fabien","2014-05-19","2014-05-26",0,"2014-05-26",0,"RTT","Acceptée",1,"2014/05"]
["GUIOT Fabien","2014-05-19","2014-05-30",0,"2014-05-30",0,"RTT","Acceptée",1,"2014/05"]
["GUIOT Fabien","2014-05-19","2014-05-28",0,"2014-05-28",0,"CP","Acceptée",1,"2014/05"]
["LOCATELLI Bruno","2014-05-20","2014-06-05",0.5,"2014-06-05",0,"RTT","Refusée",0,"2014/06","Reel Annulé par BL par mail du 04/06/2014"]
["MARZOUK Sami","2014-05-23","2014-05-30",0,"2014-05-30",0,"CP","Acceptée",1,"2014/05"]
["COUTANT Jean Paul","2014-05-25","2014-05-23",0,"2014-05-23",0,"RTT","Acceptée",1,"2014/05","RTT pour maladie"]
["LEDANT Charles","2014-05-12","2014-06-09",0,"2014-06-09",0,"RTT","Acceptée",1,"2014/06"]
["SIODMAK Eric","2014-05-26","2014-06-04",0,"2014-06-04",0.5,"RTT","Acceptée",0.5,"2014/06"]
["SIODMAK Eric","2014-05-26","2014-06-09",0,"2014-06-09",0,"RTT","Acceptée",1,"2014/06","Via 2 demandes"]
["SIODMAK Eric","2014-05-26","2014-06-17",0.5,"2014-06-17",0,"RTT","Acceptée",0.5,"2014/06"]
["LOYER Michel","2014-05-26","2014-06-25",0,"2014-06-25",0,"CP","Acceptée",1,"2014/06"]
["LOYER Michel","2014-06-26","2014-06-26",0,"2014-06-26",0,"RTT","Acceptée",1,"2014/06"]
["LOYER Michel","2014-05-26","2014-05-30",0,"2014-05-30",0,"RTT","Acceptée",1,"2014/05"]
["COUTANT Jean Paul","2014-06-02","2014-06-04",0,"2014-06-04",0,"CP","Acceptée",1,"2014/06"]
["DREZET Olivier","2014-06-11","2014-06-13",0,"2014-06-13",0,"CP","Acceptée",1,"2014/06","CP N-1"]
["MARZOUK Sami","2014-05-05","2014-05-30",0,"2014-05-30",0,"RTT","Acceptée",1,"2014/05"]
["POMMERELL Patrick","2014-06-17","2014-06-24",0,"2014-06-24",0,"RTT","Acceptée",1,"2014/06"]
["GUINOT Nathalie","2014-06-17","2014-08-08",0,"2014-08-29",0,"CP","Acceptée",15,"2014/08","Congés eté 2014"]
["DEREPPE Bruno","2014-06-17","2014-07-28",0,"2014-07-31",0,"CP","Acceptée",4,"2014/07","Congés eté 2014"]
["DEREPPE Bruno","2014-06-17","2014-08-01",0,"2014-08-14",0,"CP","Acceptée",10,"2014/08","Congés eté 2014"]
["DEREPPE Bruno","2014-06-17","2014-09-01",0,"2014-09-05",0,"CP","Acceptée",5,"2014/09","Congés eté 2014"]
["COUTANT Jean Paul","2014-06-17","2014-08-08",0,"2014-08-29",0,"CP","Acceptée",15,"2014/08","Congés eté 2014"]
["LOCATELLI Bruno","2014-05-15","2014-08-25",0,"2014-08-29",0,"CP","Acceptée",5,"2014/08","Congés eté 2014"]
["LOCATELLI Bruno","2014-05-15","2014-09-01",0,"2014-09-05",0,"CP","Acceptée",5,"2014/09","Congés eté 2014"]
["LOCATELLI Bruno","2014-05-15","2014-09-22",0,"2014-09-26",0,"CP","Acceptée",5,"2014/09","ACCORD EXCEPTIONNEL Congés eté 2014"]
["POMMERELL Patrick","2014-03-17","2014-08-01",0,"2014-08-24",0,"CP","Acceptée",15,"2014/08","Congés eté 2014"]
["VAUTRAIN Franck","2014-03-27","2014-08-04",0,"2014-08-25",0,"CP","Acceptée",15,"2014/08","Congés eté 2014"]
["GUERIN Viviane","2014-03-21","2014-08-06",0,"2014-08-08",0,"CP","Acceptée",3,"2014/08","Solde N-1"]
["GUERIN Viviane","2014-03-21","2014-08-11",0,"2014-08-29",0,"CP","Acceptée",14,"2014/08","Congés eté 2014"]
["GUERIN Viviane","2014-03-21","2014-09-01",0,"2014-09-01",0,"CP","Acceptée",1,"2014/09","Congés eté 2014"]
["GUERIN Viviane","2014-03-21","2014-09-02",0,"2014-09-02",0,"RTT","Acceptée",1,"2014/09"]
["LEDANT Charles","2014-02-14","2014-08-04",0,"2014-08-27",0,"CP","Acceptée",17,"2014/08","Congés eté 2014"]
["MARAIS Bernard","2014-02-12","2014-08-18",0,"2014-08-25",0,"CP","Acceptée",6,"2014/08","Congés eté 2014"]
["MARAIS Bernard","2014-02-12","2014-09-29",0,"2014-10-10",0,"CP","Acceptée",10,"2014/10","ACCORD EXCEPTIONNEL Congés eté 2014"]
["PLONQUET Christian","2014-04-07","2014-09-01",0,"2014-09-05",0,"CP","Acceptée",5,"2014/09","Congés eté 2014"]
["PLONQUET Christian","2014-04-07","2014-07-15",0,"2014-07-23",0,"Convention","Acceptée",0,"2014/07","RECUP"]
["KADEM Christophe","2014-04-10","2014-08-04",0,"2014-08-25",0,"CP","Acceptée",15,"2014/08","Congés eté 2014"]
["BEARZATTO Giovanni","2014-06-17","2014-08-18",0,"2014-08-31",0,"CP","Acceptée",10,"2014/08","Congés eté 2014"]
["BEARZATTO Giovanni","2014-06-17","2014-09-01",0,"2014-09-08",0,"CP","Acceptée",6,"2014/09","Congés eté 2014"]
["HAUTEBRANC Alexis","2014-06-05","2014-07-28",0,"2014-07-31",0,"CP","Acceptée",4,"2014/07","Congés eté 2014"]
["HAUTEBRANC Alexis","2014-06-05","2014-08-01",0,"2014-08-08",0,"CP","Acceptée",6,"2014/08","Congés eté 2014"]
["MINAKIAN Mathilde","2014-06-05","2014-08-01",0,"2014-08-22",0,"CP","Acceptée",15,"2014/08","Congés eté 2014"]
["HAUTEBRANC Alexis","2014-06-05","2014-09-01",0,"2014-09-05",0,"CP","Acceptée",5,"2014/09","Congés eté 2014"]
["LAZZARO Fabien","2014-05-19","2014-05-27",0,"2014-05-27",0,"RTT","Acceptée",1,"2014/05"]
["LAZZARO Fabien","2014-05-19","2014-07-28",0,"2014-07-31",0,"CP","Acceptée",4,"2014/07","Congés eté 2014"]
["LAZZARO Fabien","2014-05-19","2014-08-01",0,"2014-08-18",0,"CP","Acceptée",11,"2014/08","Congés eté 2014"]
["LAZZARO Fabien","2014-02-20","2014-11-10",0,"2014-11-10",0,"RTT","Acceptée",1,"2014/11"]
["SIODMAK Eric","2014-06-17","2014-08-11",0,"2014-08-31",0,"CP","Acceptée",14,"2014/08","Congés eté 2014"]
["SIODMAK Eric","2014-06-17","2014-09-01",0,"2014-09-02",0,"CP","Acceptée",2,"2014/09","Congés eté 2014"]
["TAQUET Alain","2014-06-17","2014-08-11",0,"2014-08-29",0,"CP","Acceptée",14,"2014/08","Congés eté 2014"]
["SOUCHET Alain","2014-06-17","2014-08-04",0,"2014-09-01",0,"CP","Acceptée",20,"2014/09","Congés eté 2014"]
["DREVON Alain","2014-06-17","2014-07-28",0,"2014-07-31",0,"CP","Acceptée",4,"2014/07","Congés eté 2014"]
["DREVON Alain","2014-06-17","2014-08-01",0,"2014-08-08",0,"CP","Acceptée",6,"2014/08","Congés eté 2014"]
["DREVON Alain","2014-06-17","2014-08-27",0.5,"2014-08-31",0,"CP","Acceptée",2.5,"2014/08","Congés eté 2014"]
["DREVON Alain","2014-06-17","2014-09-01",0,"2014-09-05",0,"CP","Acceptée",5,"2014/09","Congés eté 2014"]
["PONS Olivier","2014-06-17","2014-06-23",0,"2014-06-23",0,"RTT","Refusée",0,"2014/06","Reel Annulé par mail du 20/06/2014"]
["BERTHE Magali","2014-06-17","2014-08-11",0,"2014-08-24",0,"CP","Acceptée",9,"2014/08","Congés eté 2014"]
["GUIOT Fabien","2014-02-17","2014-08-11",0,"2014-08-29",0,"CP","Acceptée",14,"2014/08","Congés eté 2014"]
["GIRAUDON Alain","2014-06-18","2014-08-01",0,"2014-08-29",0,"CP","Acceptée",20,"2014/08","Congés eté 2014"]
["SANTUCCI Lionel","2014-06-18","2014-07-29",0.5,"2014-07-29",0,"RTT","Acceptée",0.5,"2014/07"]
["DREZET Olivier","2014-06-18","2014-08-07",0,"2014-08-31",0,"CP","Acceptée",16,"2014/08","Congés eté 2014"]
["DREZET Olivier","2014-06-18","2014-09-01",0,"2014-09-04",0,"CP","Acceptée",4,"2014/09","Congés eté 2014"]
["TAQUET Alain","2014-06-25","2014-07-18",0.5,"2014-07-21",0.5,"RTT","Acceptée",1,"2014/07"]
["COUTANT Jean Paul","2014-06-23","2014-07-16",0,"2014-07-16",0,"RTT","Acceptée",1,"2014/07"]
["GIRAUDON Alain","2014-06-23","2014-06-27",0,"2014-06-27",0,"CP","Acceptée",1,"2014/06"]
["LOYER Michel","2014-06-30","2014-07-21",0,"2014-07-21",0,"RTT","Acceptée",1,"2014/07"]
["LOYER Michel","2014-06-30","2014-07-28",0,"2014-07-28",0,"RTT","Acceptée",1,"2014/07"]
["LOYER Michel","2014-06-30","2014-07-22",0,"2014-07-25",0,"CP","Acceptée",4,"2014/07","ACCORD EXCEPTIONNEL Congés eté 2014"]
["LOYER Michel","2014-06-30","2014-07-29",0,"2014-07-31",0,"CP","Acceptée",3,"2014/07","Congés eté 2014"]
["LOYER Michel","2014-06-30","2014-08-01",0,"2014-08-14",0,"CP","Acceptée",10,"2014/08","Congés eté 2014"]
["ROBIN Kevin","2014-07-01","2014-07-18",0.5,"2014-07-21",0.5,"CP","Acceptée",1,"2014/07"]
["ROBIN Kevin","2014-07-01","2014-08-08",0,"2014-08-29",0,"CP","Acceptée",15,"2014/08","Congés eté 2014"]
["CHEVALIER Yohan","2014-07-03","2014-07-28",0,"2014-07-31",0,"CP","Acceptée",4,"2014/07","Congés eté 2014"]
["CHEVALIER Yohan","2014-07-03","2014-08-01",0,"2014-08-05",0,"CP","Acceptée",3,"2014/08","Congés eté 2014"]
["CHEVALIER Yohan","2014-07-03","2014-08-28",0,"2014-08-29",0,"CP","Acceptée",2,"2014/08","Congés eté 2014"]
["BEARZATTO Giovanni","2014-07-03","2014-07-10",0,"2014-07-10",0,"CP","Acceptée",1,"2014/07"]
["BEARZATTO Giovanni","2014-07-03","2014-07-11",0,"2014-07-11",0,"RTT","Acceptée",1,"2014/07"]
["HAUTEBRANC Alexis","2014-07-03","2014-07-04",0,"2014-07-04",0,"RTT","Acceptée",1,"2014/07"]
["SOUCHET Alain","2014-07-03","2014-07-03",0,"2014-07-03",0.5,"RTT","Acceptée",0.5,"2014/07"]
["KADEM Christophe","2014-07-07","2014-07-15",0,"2014-07-15",0,"RTT","Acceptée",1,"2014/07"]
["KADEM Christophe","2014-07-05","2014-09-01",0,"2014-09-01",0,"RTT","Acceptée",1,"2014/09"]
["HEMLER Christelle","2014-07-01","2014-07-09",0,"2014-07-09",0,"RTT","Acceptée",1,"2014/07"]
["HEMLER Christelle","2014-07-02","2014-07-28",0,"2014-07-31",0,"CP","Acceptée",4,"2014/07","Congés eté 2014"]
["HEMLER Christelle","2014-07-02","2014-08-01",0,"2014-08-08",0,"CP","Acceptée",6,"2014/08","Congés eté 2014"]
["HEMLER Christelle","2014-07-02","2014-09-01",0,"2014-09-05",0,"CP","Acceptée",5,"2014/09","Congés eté 2014"]
["SANTUCCI Lionel","2014-07-15","2014-08-04",0,"2014-08-25",0,"CP","Acceptée",15,"2014/08","Congés eté 2014"]
["PONS Olivier","2014-07-15","2014-07-25",0,"2014-07-31",0,"CP","Acceptée",5,"2014/07","Congés eté 2014"]
["PONS Olivier","2014-07-15","2014-08-01",0,"2014-08-17",0,"CP","Acceptée",10,"2014/08","Congés eté 2014"]
["GUIOT Fabien","2014-07-15","2014-08-08",0,"2014-08-08",0,"CP","Acceptée",1,"2014/08","Congés eté 2014"]
["TAQUET Alain","2014-07-16","2014-08-07",0,"2014-08-07",0,"RTT","Acceptée",1,"2014/08"]
["TAQUET Alain","2014-07-16","2014-09-01",0,"2014-09-01",0,"CP","Acceptée",1,"2014/09","Congés eté 2014"]
["DEREPPE Bruno","2014-07-17","2014-07-25",0,"2014-07-25",0,"RTT","Acceptée",1,"2014/07"]
["PLONQUET Christian","2014-07-22","2014-08-04",0,"2014-08-29",0,"CP","Acceptée",17,"2014/08","Congés eté 2014"]
["HEMLER Christelle","2014-07-22","2014-07-25",0,"2014-07-25",0,"RTT","Acceptée",1,"2014/07"]
["MARAIS Bernard","2014-07-22","2014-08-27",0,"2014-08-29",0,"CP","Acceptée",3,"2014/08","Congés eté 2014"]
["GUERIN Viviane","2014-03-03","2014-07-11",0,"2014-07-11",0.5,"RTD Recup","Acceptée",0.5,"2014/07","ARTD 2014"]
["GUERIN Viviane","2014-07-31","2014-11-10",0,"2014-11-10",0,"RTT","Acceptée",1,"2014/11"]
["GUERIN Viviane","2014-07-31","2014-11-21",0,"2014-11-21",0,"RTD Recup","Acceptée",1,"2014/11","ARTD 2014"]
["GUERIN Viviane","2014-07-31","2014-11-24",0,"2014-11-24",0,"RTT","Acceptée",1,"2014/11"]
["GUERIN Viviane","2014-07-31","2014-12-24",0,"2014-12-24",0,"RTD Recup","Acceptée",1,"2014/12","ARTD 2014"]
["GUERIN Viviane","2014-07-31","2014-12-26",0,"2014-12-26",0,"RTT","Acceptée",1,"2014/12"]
["GUERIN Viviane","2014-07-31","2014-12-22",0,"2014-12-23",0,"CP","Refusée",0,"2014/12","trop de jours demandés sur période rouge"]
["HAUTEBRANC Alexis","2014-08-11","2014-10-10",0,"2014-10-10",0,"RTT","Acceptée",1,"2014/10"]
["HAUTEBRANC Alexis","2014-08-11","2014-10-13",0,"2014-10-13",0,"CP","Acceptée",1,"2014/10"]
["DREVON Alain","2014-08-12","2014-08-25",0,"2014-08-27",0.5,"CP","Annulée",-2.5,"2014/08","Congés eté 2014"]
["LAZZARO Fabien","2014-08-19","2014-09-12",0,"2014-09-12",0,"RTT","Acceptée",1,"2014/09"]
["LAZZARO Fabien","2014-08-19","2014-09-15",0,"2014-09-15",0,"RTT","Acceptée",1,"2014/09"]
["SANTUCCI Lionel","2014-08-26","2014-08-27",0,"2014-08-27",0.5,"RTT","Acceptée",0.5,"2014/08"]
["SANTUCCI Lionel","2014-09-01","2014-09-04",0,"2014-09-04",0.5,"RTT","Acceptée",0.5,"2014/09"]
["SANTUCCI Lionel","2014-09-09","2014-09-29",0,"2014-09-29",0,"CP","Acceptée",1,"2014/09"]
["LOYER Michel","2014-09-04","2014-09-24",0,"2014-09-24",0,"CP","Acceptée",1,"2014/09"]
["LOYER Michel","2014-09-04","2014-09-25",0,"2014-09-25",0,"RTT","Acceptée",1,"2014/09"]
["LOYER Michel","2014-09-04","2014-10-20",0,"2014-10-20",0,"CP","Acceptée",1,"2014/10"]
["LOYER Michel","2014-09-04","2014-10-21",0,"2014-10-21",0,"RTT","Acceptée",1,"2014/10"]
["POMMERELL Patrick","2014-09-04","2014-09-01",0.5,"2014-09-01",0,"RTT","Acceptée",0.5,"2014/09"]
["POMMERELL Patrick","2014-09-04","2014-09-02",0.5,"2014-09-02",0,"RTT","Acceptée",0.5,"2014/09"]
["POMMERELL Patrick","2014-09-04","2014-09-09",0.5,"2014-09-09",0,"RTT","Acceptée",0.5,"2014/09"]
["HEMLER Christelle","2014-09-10","2014-09-17",0,"2014-09-17",0,"RTT","Acceptée",1,"2014/09"]
["SIODMAK Eric","2014-09-11","2014-09-16",0,"2014-09-16",0,"RTT","Acceptée",1,"2014/09"]
["SIODMAK Eric","2014-09-11","2014-09-22",0,"2014-09-22",0,"RTT","Acceptée",1,"2014/09"]
["MARZOUK Sami","2014-05-05","2014-08-01",0,"2014-08-31",0,"CP","Acceptée",20,"2014/08","Congés eté 2014"]
["LEDANT Charles","2014-09-16","2014-09-29",0,"2014-09-29",0,"RTT","Acceptée",1,"2014/09"]
["LEDANT Charles","2014-09-16","2014-10-06",0,"2014-10-06",0,"RTT","Acceptée",1,"2014/10"]
["LOCATELLI Bruno","2014-09-11","2014-09-29",0,"2014-09-29",0,"CP","Acceptée",1,"2014/09","ACCORD EXCEPTIONNEL Congés eté 2014"]
["DREZET Olivier","2014-09-19","2014-10-20",0,"2014-10-20",0,"RTT","Acceptée",1,"2014/10"]
["COUTANT Jean Paul","2014-09-19","2014-10-20",0,"2014-10-20",0,"RTT","Acceptée",1,"2014/10"]
["PLONQUET Christian","2014-10-23","2014-10-22",0,"2014-10-22",0,"CP","Acceptée",1,"2014/10"]
["BERTHE Magali","2014-09-23","2014-11-07",0,"2014-11-07",0.5,"CP","Acceptée",0.5,"2014/11"]
["MARAIS Bernard","2014-09-25","2014-12-26",0,"2014-12-26",0,"CP","Acceptée",1,"2014/12"]
["MARAIS Bernard","2014-09-25","2015-01-02",0,"2015-01-02",0,"CP","Acceptée",1,"2015/01"]
["ROBIN Kevin","2014-09-25","2014-11-10",0,"2014-11-10",0,"CP","Acceptée",1,"2014/11"]
["TAQUET Alain","2014-09-29","2014-09-30",0,"2014-09-30",0,"RTT","Acceptée",1,"2014/09"]
["SOUCHET Alain","2014-10-01","2014-11-10",0,"2014-11-10",0,"RTT","Acceptée",1,"2014/11"]
["SOUCHET Alain","2014-10-01","2014-12-26",0,"2014-12-26",0,"RTT","Acceptée",1,"2014/12"]
["KADEM Christophe","2014-10-01","2014-11-10",0,"2014-11-10",0,"RTT","Acceptée",1,"2014/11"]
["KADEM Christophe","2014-10-01","2014-12-26",0,"2014-12-26",0,"RTT","Acceptée",1,"2014/12"]
["LAZZARO Fabien","2014-10-01","2014-12-26",0,"2014-12-26",0,"RTT","Acceptée",1,"2014/12"]
["SIODMAK Eric","2014-10-05","2014-10-06",0,"2014-10-06",0,"RTT","Acceptée",1,"2014/10"]
["DREZET Olivier","2014-10-02","2014-11-03",0,"2014-11-03",0,"RTT","Acceptée",1,"2014/11"]
["PLONQUET Christian","2014-10-06","2014-10-27",0,"2014-10-27",0,"CP","Acceptée",1,"2014/10"]
["DREZET Olivier","2014-10-06","2014-10-31",0,"2014-10-31",0,"RTT","Acceptée",1,"2014/10"]
["TAQUET Alain","2014-10-07","2014-10-23",0,"2014-10-23",0,"RTT","Acceptée",1,"2014/10"]
["HEMLER Christelle","2014-10-08","2014-10-15",0,"2014-10-15",0,"RTT","Acceptée",1,"2014/10"]
["GUINOT Nathalie","2014-10-08","2014-10-08",0,"2014-10-08",0.5,"RTT","Acceptée",0.5,"2014/10"]
["GUINOT Nathalie","2014-10-13","2014-10-30",0,"2014-10-31",0,"RTT","Acceptée",2,"2014/10"]
["GIRAUDON Alain","2014-10-14","2014-10-17",0,"2014-10-17",0.5,"RTT","Acceptée",0.5,"2014/10"]
["MARAIS Bernard","2014-10-14","2015-02-09",0,"2015-02-13",0,"CP","Acceptée",5,"2015/02"]
["LEDANT Charles","2014-10-17","2014-11-10",0,"2014-11-10",0,"CP","Acceptée",1,"2014/11"]
["BEARZATTO Giovanni","2014-10-21","2014-11-10",0,"2014-11-10",0,"RTT","Acceptée",1,"2014/11"]
["GUIOT Fabien","2014-10-20","2014-10-24",0,"2014-10-24",0,"RTT","Acceptée",1,"2014/10"]
["GUIOT Fabien","2014-10-20","2014-11-10",0,"2014-11-10",0,"RTT","Acceptée",1,"2014/11"]
["LAZZARO Fabien","2014-10-22","2014-11-03",0,"2014-11-03",0,"RTD Recup","Acceptée",1,"2014/11","ARTD 2014"]
["SANTUCCI Lionel","2014-10-23","2014-10-24",0,"2014-10-24",0,"RTT","Acceptée",1,"2014/10","Demande de CP acceptée en RTT"]
["GUINOT Nathalie","2014-10-14","2014-02-23",0,"2014-02-27",0,"CP","Acceptée",4,"2014/02"]
["BERTHE Magali","2014-10-16","2014-11-10",0,"2014-11-10",0,"CP","Acceptée",1,"2014/11"]
["MINAKIAN Mathilde","2014-10-27","2014-11-10",0,"2014-11-10",0,"CP","Acceptée",1,"2014/11"]
["COUTANT Jean Paul","2014-10-27","2014-11-10",0,"2014-11-10",0,"RTT","Acceptée",1,"2014/11"]
["DEREPPE Bruno","2014-10-30","2014-11-10",0,"2014-11-10",0,"RTT","Acceptée",1,"2014/11"]
["KADEM Christophe","2014-11-03","2014-11-17",0,"2014-11-17",0,"RTT","Acceptée",1,"2014/11"]
["KADEM Christophe","2014-11-03","2014-11-25",0,"2014-11-25",0,"RTT","Acceptée",1,"2014/11"]
["KADEM Christophe","2014-11-03","2014-12-10",0,"2014-12-10",0,"CP","Acceptée",1,"2014/12","RTT transformé en CP  "]
["MARZOUK Sami","2014-11-04","2014-11-10",0,"2014-11-10",0,"RTT","Acceptée",1,"2014/11"]
["MARZOUK Sami","2014-11-04","2014-12-24",0,"2014-12-26",0,"RTT","Acceptée",2,"2014/12"]
["PLONQUET Christian","2014-11-12","2014-10-22",0,"2014-10-22",0,"CP","Annulée",-1,"2014/10"]
["PLONQUET Christian","2014-11-12","2014-10-27",0,"2014-10-27",0,"CP","Annulée",-1,"2014/10"]
["PLONQUET Christian","2014-11-12","2014-11-18",0,"2014-11-19",0,"CP","Acceptée",2,"2014/11"]
["LOCATELLI Bruno","2014-11-12","2014-12-26",0,"2014-12-26",0,"RTT","Acceptée",1,"2014/12"]
["DREZET Olivier","2014-11-13","2014-12-24",0,"2014-12-26",0,"RTT","Acceptée",2,"2014/12"]
["DREZET Olivier","2014-11-13","2014-12-31",0,"2014-12-31",0,"CP","Acceptée",1,"2014/12"]
["DREZET Olivier","2014-11-17","2014-11-20",0,"2014-11-20",0,"CP","Acceptée",1,"2014/11"]
["PONS Olivier","2014-11-17","2015-02-23",0,"2015-03-03",0,"CP","Acceptée",7,"2015/03"]
["GIRAUDON Alain","2014-11-18","2014-12-12",0,"2014-12-12",0.5,"RTT","Acceptée",0.5,"2014/12"]
["GIRAUDON Alain","2014-11-18","2014-12-26",0,"2014-12-26",0,"RTT","Acceptée",1,"2014/12"]
["LOCATELLI Bruno","2014-11-18","2014-12-02",0,"2014-12-02",0,"RTT","Acceptée",1,"2014/12"]
["HAUTEBRANC Alexis","2014-11-20","2014-12-19",0,"2014-12-19",0.5,"CP","Acceptée",0.5,"2014/12"]
["HAUTEBRANC Alexis","2014-11-20","2014-12-19",0,"2014-12-19",0,"RTT","Acceptée",1,"2014/12"]
["POMMERELL Patrick","2014-11-19","2014-11-21",0,"2014-11-21",0.5,"RTT","Acceptée",0.5,"2014/11","Demande de CP transformée en RTT "]
["CHEVALIER Yohan","2014-11-19","2014-12-15",0,"2014-12-16",0,"CP","Refusée",0,"2014/12","Trop de CP anticipés (solde de -6"]
["HEMLER Christelle","2014-11-24","2014-12-24",0.5,"2014-12-26",0,"RTT","Acceptée",1.5,"2014/12"]
["LEDANT Charles","2014-11-25","2014-12-26",0,"2014-12-26",0,"RTT","Acceptée",1,"2014/12"]
["LAZZARO Fabien","2014-11-25","2014-12-12",0,"2014-12-12",0,"RTT","Acceptée",1,"2014/12"]
["MINAKIAN Mathilde","2014-11-25","2015-01-02",0,"2015-01-02",0,"CP","Acceptée",1,"2015/01"]
["BERTHE Magali","2014-11-25","2015-01-02",0,"2015-01-02",0,"CP","Acceptée",1,"2015/01"]
["COUTANT Jean Paul","2014-11-26","2014-12-26",0,"2014-12-26",0,"RTT","Acceptée",1,"2014/12"]
["ROBIN Kevin","2014-11-26","2014-12-15",0,"2014-12-15",0.5,"CP","Acceptée",0.5,"2014/12"]
["ROBIN Kevin","2014-11-26","2014-12-26",0,"2014-12-26",0,"CP","Acceptée",1,"2014/12"]
["ROBIN Kevin","2014-11-26","2015-01-02",0,"2015-01-02",0,"CP","Acceptée",1,"2015/01"]
["DEREPPE Bruno","2014-11-26","2014-12-26",0,"2014-12-26",0,"RTT","Acceptée",1,"2014/12"]
["MARZOUK Sami","2014-11-27","2014-12-05",0,"2014-12-05",0,"RTT","Acceptée",1,"2014/12"]
["POMMERELL Patrick","2014-11-06","2014-12-26",0,"2014-12-26",0,"RTT","Acceptée",1,"2014/12"]
["SANTUCCI Lionel","2014-12-01","2014-12-01",0,"2014-12-01",0.5,"RTT","Acceptée",0.5,"2014/12"]
["DEREPPE Bruno","2014-12-01","2014-12-24",0,"2014-12-24",0,"RTT","Acceptée",1,"2014/12","Demande de CP transformée en RTT "]
["HEMLER Christelle","2014-12-02","2014-12-24",0.5,"2014-12-24",0,"CP","Acceptée",0.5,"2014/12",null,25.46]
["CHEVALIER Yohan","2014-12-02","2014-12-03",0.5,"2014-12-03",0,"CP sans solde","Acceptée",0,"2014/12",null,0]
["CHEVALIER Yohan","2014-12-02","2015-01-02",0,"2015-01-02",0,"CP sans solde","Acceptée",0,"2015/01",null,0]
["DREZET Olivier","2014-12-01","2015-01-02",0,"2015-01-02",0,"RTT","Acceptée",1,"2015/01","RTT Direction"]
["KADEM Christophe","2014-12-01","2015-01-02",0,"2015-01-02",0,"RTT","Acceptée",1,"2015/01","RTT Direction"]
["SIODMAK Eric","2014-12-01","2015-01-02",0,"2015-01-02",0,"RTT","Acceptée",1,"2015/01","RTT Direction"]
["TAQUET Alain","2014-12-01","2015-01-02",0,"2015-01-02",0,"RTT","Acceptée",1,"2015/01","RTT Direction"]
["GUERIN Viviane","2014-12-01","2015-01-02",0,"2015-01-02",0,"RTT","Acceptée",1,"2015/01","RTT Direction"]
["LAZZARO Fabien","2014-12-01","2015-01-02",0,"2015-01-02",0,"RTT","Acceptée",1,"2015/01","RTT Direction"]
["MARZOUK Sami","2014-12-01","2015-01-02",0,"2015-01-02",0,"RTT","Acceptée",1,"2015/01","RTT Direction"]
["SOUCHET Alain","2014-12-01","2015-01-02",0,"2015-01-02",0,"RTT","Acceptée",1,"2015/01","RTT Direction"]
["POMMERELL Patrick","2014-12-01","2015-01-02",0,"2015-01-02",0,"RTT","Acceptée",1,"2015/01","RTT Direction"]
["DEREPPE Bruno","2014-12-01","2015-01-02",0,"2015-01-02",0,"RTT","Acceptée",1,"2015/01","RTT Direction"]
["COUTANT Jean Paul","2014-12-01","2015-01-02",0,"2015-01-02",0,"RTT","Acceptée",1,"2015/01","RTT Direction"]
["PONS Olivier","2014-12-01","2015-01-02",0,"2015-01-02",0,"RTT","Acceptée",1,"2015/01","RTT Direction"]
["GIRAUDON Alain","2014-11-18","2014-12-31",0,"2014-12-31",0.5,"RTT","Acceptée",0.5,"2014/12"]
["GIRAUDON Alain","2014-12-01","2015-01-02",0,"2015-01-02",0,"RTT","Acceptée",1,"2015/01","RTT Direction"]
["LOYER Michel","2014-12-01","2015-01-02",0,"2015-01-02",0,"RTT","Acceptée",1,"2015/01","RTT Direction"]
["DREVON Alain","2014-12-01","2015-01-02",0,"2015-01-02",0,"RTT","Acceptée",1,"2015/01","RTT Direction"]
["BEARZATTO Giovanni","2014-12-01","2015-01-02",0,"2015-01-02",0,"RTT","Acceptée",1,"2015/01","RTT Direction"]
["LOCATELLI Bruno","2014-12-01","2015-01-02",0,"2015-01-02",0,"RTT","Acceptée",1,"2015/01","RTT Direction"]
["SANTUCCI Lionel","2014-12-01","2015-01-02",0,"2015-01-02",0,"RTT","Acceptée",1,"2015/01","RTT Direction"]
["VAUTRAIN Franck","2014-12-01","2015-01-02",0,"2015-01-02",0,"RTT","Acceptée",1,"2015/01","RTT Direction"]
["LEDANT Charles","2014-12-01","2015-01-02",0,"2015-01-02",0,"RTT","Acceptée",1,"2015/01","RTT Direction"]
["HAUTEBRANC Alexis","2014-12-01","2015-01-02",0,"2015-01-02",0,"RTT","Acceptée",1,"2015/01","RTT Direction"]
["HEMLER Christelle","2014-12-01","2015-01-02",0,"2015-01-02",0,"RTT","Acceptée",1,"2015/01","RTT Direction"]
["GUIOT Fabien","2014-12-01","2015-01-02",0,"2015-01-02",0,"RTT","Acceptée",1,"2015/01","RTT Direction"]
["GUINOT Nathalie","2014-12-01","2015-01-02",0,"2015-01-02",0,"RTT","Acceptée",1,"2015/01","RTT Direction"]
["LANGE Sébastien","2014-12-01","2015-01-02",0,"2015-01-02",0,"CP","Acceptée",1,"2015/01","CP"]
["GUINOT Nathalie","2015-02-23","2015-02-23",0,"2015-02-27",0,"CP","Acceptée",5,"2015/02"]
["GUINOT Nathalie","2014-12-04","2014-12-22",0,"2014-12-23",0,"RTT","Acceptée",2,"2014/12"]
["SANTUCCI Lionel","2014-12-08","2014-12-10",0,"2014-12-11",0,"RTT","Acceptée",2,"2014/12"]
["VAUTRAIN Franck","2014-12-08","2014-12-25",0,"2014-12-31",0,"CP","Refusée",0,"2014/12","Période rouge "]
["VAUTRAIN Franck","2014-12-08","2014-12-26",0,"2014-12-26",0,"RTT","Acceptée",1,"2014/12"]
["VAUTRAIN Franck","2014-12-08","2014-12-31",0,"2014-12-31",0,"RTT","Acceptée",1,"2014/12"]
["MARZOUK Sami","2014-12-10","2014-12-11",0,"2014-12-11",0,"RTT","Acceptée",1,"2014/12"]
["BEARZATTO Giovanni","2014-12-11","2014-12-19",0,"2014-12-19",0,"RTT","Acceptée",1,"2014/12"]
["BEARZATTO Giovanni","2014-12-11","2014-12-31",0,"2014-12-31",0,"RTT","Acceptée",1,"2014/12"]
["GUIOT Fabien","2014-12-12","2014-12-26",0,"2014-12-26",0,"CP","Acceptée",1,"2014/12"]
["COUTANT Jean Paul","2014-12-15","2014-12-16",0,"2014-12-16",0.5,"RTT","Acceptée",0.5,"2014/12"]
["VAUTRAIN Franck","2014-12-15","2014-12-22",0,"2014-12-22",0,"RTT","Acceptée",1,"2014/12"]
["DREVON Alain","2014-12-11","2014-12-24",0,"2014-12-26",0,"RTT","Acceptée",2,"2014/12"]
["DREVON Alain","2014-12-11","2014-12-31",0,"2014-12-31",0,"RTT","Acceptée",1,"2014/12"]
["SIODMAK Eric","2014-12-15","2014-12-18",0.5,"2014-12-18",0,"RTT","Acceptée",0.5,"2014/12"]
["LOYER Michel","2014-12-15","2014-12-26",0,"2014-12-26",0,"CP","Acceptée",1,"2014/12"]
["GUIOT Fabien","2014-12-12","2014-12-24",0,"2014-12-24",0,"RTT","Acceptée",1,"2014/12"]
["GUERIN Viviane","2014-12-10","2014-01-29",0,"2014-01-30",0,"RTD Recup","Acceptée",2,"2014/01","ARTD 2014"]
["LEDANT Charles","2014-12-16","2014-12-16",0,"2014-12-16",0.5,"RTT","Acceptée",0.5,"2014/12"]
["PONS Olivier","2014-12-17","2014-12-24",0,"2014-12-26",0,"RTT","Acceptée",2,"2014/12","",4.5]
["PONS Olivier","2014-12-17","2014-12-31",0,"2014-12-31",0,"RTT","Acceptée",1,"2014/12"]
["LEDANT Charles","2014-12-17","2014-12-19",0,"2014-12-19",0,"Convention","Acceptée",0,"2014/12","Décès Belle-mère"]
["LEDANT Charles","2014-12-17","2014-12-23",0,"2014-12-23",0.5,"RTT","Acceptée",0.5,"2014/12"]
["LOCATELLI Bruno","2014-12-19","2015-03-09",0,"2015-03-13",0,"CP","Acceptée",5,"2015/03",0,5.9600000000000009]
["SIODMAK Eric","2014-12-22","2014-12-31",0,"2014-12-31",0,"CP","Acceptée",1,"2014/12",0,10.96]
["SANTUCCI Lionel","2014-12-22","2014-12-23",0,"2014-12-23",0,"RTT","Acceptée",1,"2014/12",0,0.5]
["SANTUCCI Lionel","2014-12-22","2014-12-26",0,"2014-12-26",0,"CP","Acceptée",1,"2014/12",0,12.96]
["LOCATELLI Bruno","2014-12-22","2014-12-31",0,"2014-12-31",0,"RTT","Acceptée",1,"2014/12",0,1.5]
["GIRAUDON Alain","2014-12-29","2015-03-09",0,"2015-03-13",0,"CP","Acceptée",5,"2015/03",0,-3.9999999999999147E-2]
["MARZOUK Sami","2014-12-30","2014-12-31",0,"2014-12-31",0,"CP","Acceptée",1,"2014/12",0,7.9600000000000009]
["LOCATELLI Bruno","2015-01-05","2015-01-19",0,"2015-01-19",0,"RTT","Acceptée",1,"2015/01",0,0.5]
["LOYER Michel","2015-01-05","2015-05-07",0,"2015-05-07",0,"RTT","Acceptée",1,"2015/05",0,-0.5]
["LOYER Michel","2015-01-05","2015-05-04",0,"2015-05-06",0,"CP","Acceptée",3,"2015/05",0,1.9600000000000009]
["SANTUCCI Lionel","2015-01-05","2015-01-16",0,"2015-01-16",0,"RTT","Acceptée",1,"2015/01","Remplacement de la journée non prise lors de ta dernière venue.",-0.5]
["PONS Olivier","2015-01-07","2015-01-09",0,"2015-01-09",0,"RTT","Acceptée",1,"2015/01",0,2.5]
["BEARZATTO Giovanni","2015-01-07","2015-02-19",0,"2015-02-19",0,"RTT","Acceptée",1,"2015/02",0,1]
["BEARZATTO Giovanni","2015-01-07","2015-02-20",0,"2015-02-27",0,"CP","Acceptée",6,"2015/02",0,4.4600000000000009]
["BEARZATTO Giovanni","2015-01-07","2015-03-01",0,"2015-03-03",0,"CP","Acceptée",2,"2015/03",0,8.4600000000000009]
["BEARZATTO Giovanni","2015-01-07","2015-03-04",0,"2015-03-04",0,"RTT","Acceptée",1,"2015/03",0,1]
["LAZZARO Fabien","2015-01-08","2015-01-30",0,"00:00:00",0,"RTD Recup","Acceptée",0,"2015/01","",""]
["VAUTRAIN Franck","2015-01-08","2015-01-12",0,"2015-01-12",0,"RTT","Acceptée",1,"2015/01","",2.5]
["LOCATELLI Bruno","2015-01-12","2015-01-27",0,"2015-01-27",0,"RTT","Acceptée",1,"2015/01","",0]
["KADEM Christophe","2015-01-14","2015-03-02",0,"2015-03-06",0,"CP","Acceptée",5,"2015/03","",5.4600000000000009]
["PONS Olivier","2015-01-19","2015-02-06",0,"2015-02-06",0,"RTT","Acceptée",1,"2015/02","",2]
["GUERIN Viviane","2015-01-20","2015-01-23",0,"2015-01-23",0,"RTT","Acceptée",1,"2015/01","",1]
["TAQUET Alain","2015-01-21","2015-03-02",0,"2015-03-05",0,"CP","Acceptée",4,"2015/03","",6.9600000000000009]
["TAQUET Alain","2015-01-21","2015-03-06",0,"2015-03-06",0,"RTT","Acceptée",1,"2015/03","",2]
["TAQUET Alain","2015-01-21","2015-02-27",0,"2015-02-27",0,"RTT","Acceptée",1,"2015/02","",2]
["VAUTRAIN Franck","2015-01-23","2015-01-30",0,"2015-01-30",0,"RTT","Annulée",0,"2015/01","reportée au 13/02 par FV",1]
["POMMERELL Patrick","2015-01-25","2015-04-27",0,"2015-04-30",0,"CP","Acceptée",4,"2015/04",null,9.4600000000000009]
["POMMERELL Patrick","2015-01-25","2015-05-25",0,"2015-05-25",0,"CP","Acceptée",0,"2015/05",null,12.46]
["MARAIS Bernard","2015-01-26","2015-08-10",0,"2015-08-14",0,"CP","Acceptée",5,"2015/08","Congés eté 2015",-3.0399999999999991]
["MARAIS Bernard","2015-01-26","2015-08-17",0,"2015-08-21",0,"CP","Acceptée",5,"2015/08","Congés eté 2015",-3.0399999999999991]
["ROBIN Kevin","2015-01-26","2015-02-09",0,"2015-02-09",0,"CP","Acceptée",1,"2015/02"]
["LOYER Michel","2015-01-26","2015-03-03",0,"2015-03-04",0,"CP","Acceptée",2,"2015/03","",-3.9999999999999147E-2]
["LOYER Michel","2015-01-26","2015-03-02",0,"2015-03-02",0,"RTT","Acceptée",1,"2015/03","",-1]
["VAUTRAIN Franck","2015-01-29","2015-02-13",0,"2015-02-13",0,"RTT","Acceptée",1,"2015/02"]
["LEDANT Charles","2015-02-02","2015-01-29",0,"2015-01-30",0,"CP","Acceptée",2,"2015/01","Malade",8.9600000000000009]
["HAUTEBRANC Alexis","2015-01-28","2015-05-26",0,"2015-05-29",0,"CP","Acceptée",4,"2015/05"]
["HEMLER Christelle","2015-02-03","2015-02-05",0.5,"2015-02-05",0,"RTT","Acceptée",0.5,"2015/02","",0.5]
["DREZET Olivier","2015-02-04","2015-04-27",0,"2015-04-30",0,"CP","Acceptée",4,"2015/04","",4.4600000000000009]
["DREVON Alain","2015-02-08","2015-02-16",0,"2015-02-20",0,"CP","Acceptée",5,"2015/02","",5.4600000000000009]
["GIRAUDON Alain","2015-02-09","2015-02-20",0,"2015-02-20",0,"RTT","Acceptée",1,"2015/02","",0.5]
["DEREPPE Bruno","2015-02-09","2015-03-16",0,"2015-03-20",0,"CP","Acceptée",5,"2015/03","",3.9600000000000009]
["SIODMAK Eric","2015-02-09","2015-02-23",0,"2015-02-27",0,"CP","Acceptée",5,"2015/02","",5.9600000000000009]
["SIODMAK Eric","2015-02-09","2015-04-27",0,"2015-05-01",0,"CP","Acceptée",4,"2015/05","",7.96]
["GUERIN Viviane","2015-02-10","2015-02-16",0,"2015-02-16",0,"RTT","Acceptée",1,"2015/02","",0]
["GUERIN Viviane","2015-02-10","2015-05-04",0,"2015-05-07",0,"CP","Acceptée",4,"2015/05","",6.9600000000000009]
["GUIOT Fabien","2015-02-11","2015-02-23",0,"2015-02-23",0,"RTT","Acceptée",1,"2015/02","",0]
["ROBIN Kevin","2015-02-12","2015-02-23",0,"2015-02-23",0,"CP","Acceptée",1,"2015/02","",-6.0399999999999991]
["POMMERELL Patrick","2015-02-16","2015-02-24",0,"2015-02-25",0,"CP","Acceptée",2,"2015/02","",6.4600000000000009]
["KADEM Christophe","2015-02-17","2015-03-25",0,"2015-03-25",0,"RTT","Acceptée",1,"2015/03","",-0.5]
["KADEM Christophe","2015-02-17","2015-05-04",0,"2015-05-07",0,"CP","Acceptée",4,"2015/05","",1.4600000000000009]
["KADEM Christophe","2015-02-17","2015-05-29",0.5,"2015-05-29",0,"CP","Acceptée",0.5,"2015/05","",4.9600000000000009]
["KADEM Christophe","2015-02-17","2015-07-27",0,"2015-07-31",0,"CP","Acceptée",5,"2015/07","Congés eté 2015",-9.5399999999999991]
["KADEM Christophe","2015-02-17","2015-08-01",0,"2015-08-16",0,"CP","Acceptée",10,"2015/08","Congés eté 2016"]
["HAUTEBRANC Alexis","2015-02-18","2015-03-25",0.5,"2015-03-25",0,"CP","Acceptée",0.5,"2015/03","",4.9600000000000009]
["HAUTEBRANC Alexis","2015-02-18","2015-03-26",0,"2015-03-27",0,"CP","Acceptée",2,"2015/03","",3.4600000000000009]
["LEDANT Charles","2015-02-18","2015-03-05",0,"2015-03-05",0,"CP","Acceptée",1,"2015/03","",7.9600000000000009]
["LEDANT Charles","2015-02-18","2015-03-13",0,"2015-03-13",0,"CP","Acceptée",1,"2015/03","",7.9600000000000009]
["LEDANT Charles","2015-02-18","2015-03-23",0,"2015-03-23",0,"CP","Acceptée",1,"2015/03","",7.9600000000000009]
["LEDANT Charles","2015-02-18","2015-04-20",0,"2015-04-20",0,"RTT","Acceptée",1,"2015/04","",0.5]
["LEDANT Charles","2015-02-18","2015-05-04",0,"2015-05-07",0,"CP","Acceptée",4,"2015/05","",4.9600000000000009]
["LEDANT Charles","2015-02-18","2015-05-15",0,"2015-05-15",0,"CP","Acceptée",1,"2015/05","",7.9600000000000009]
["MARAIS Bernard","2015-02-19","2015-08-03",0,"2015-08-07",0,"CP","Acceptée",5,"2015/08","Congés eté 2015",-2.0399999999999991]
["DREZET Olivier","2015-02-25","2015-02-27",0,"2015-02-27",0,"RTT","Acceptée",1,"2015/02","",0.5]
["VAUTRAIN Franck","2015-02-26","2015-03-04",0.5,"2015-03-04",0,"RTT","Acceptée",0.5,"2015/03","",1]
["LOCATELLI Bruno","2015-02-26","2015-07-27",0,"2015-07-31",0,"CP","Acceptée",5,"2015/07","Congés eté 2015",0.96000000000000085]
["LOCATELLI Bruno","2015-02-26","2015-08-24",0,"2015-08-31",0,"CP","Acceptée",6,"2015/08","Congés eté 2015",-6.0399999999999991]
["LOCATELLI Bruno","2015-02-26","2015-09-01",0,"2015-09-08",0,"CP","Acceptée",6,"2015/09","Congés eté 2016"]
["GUERIN Viviane","2015-02-27","2015-07-13",0,"2015-07-13",0,"CP","Acceptée",1,"2015/07","",5.9600000000000009]
["SOUCHET Alain","2015-03-03","2015-05-04",0,"2015-05-07",0,"CP","Acceptée",4,"2015/05","",6.4600000000000009]
["GUIOT Fabien","2015-03-03","2015-04-27",0,"2015-04-30",0,"CP","Acceptée",4,"2015/04","",4.9600000000000009]
["GUIOT Fabien","2015-03-03","2015-05-11",0,"2015-05-15",0,"CP","Acceptée",4,"2015/05","",4.9600000000000009]
["GUERIN Viviane","2015-03-04","2015-07-15",0,"2015-07-15",0,"RTT","Acceptée",1,"2015/07","",-0.5]
["SANTUCCI Lionel","2015-03-05","2015-03-30",0,"2015-03-31",0,"CP","Acceptée",2,"2015/03","",11]
["SANTUCCI Lionel","2015-03-05","2015-04-01",0,"2015-04-03",0,"CP","Acceptée",3,"2015/04",null,8]
["COUTANT Jean Paul","2015-03-05","2015-03-11",0,"2015-03-11",0,"RTT","Acceptée",1,"2015/03","",1.5]
["COUTANT Jean Paul","2015-03-05","2015-03-25",0,"2015-03-25",0,"RTT","Acceptée",1,"2015/03","",1.5]
["GIRAUDON Alain","2015-03-05","2015-03-06",0.5,"2015-03-06",0,"RTT","Acceptée",0.5,"2015/03","",1.5]
["GUINOT Nathalie","2015-03-06","2015-04-29",0,"2015-04-30",0,"CP","Acceptée",2,"2015/04","",8.9600000000000009]
["HEMLER Christelle","2015-03-09","2015-03-12",0,"2015-03-12",0,"CP","Acceptée",1,"2015/03","",1]
["KADEM Christophe","2015-03-09","2015-03-18",0,"2015-03-18",0,"RTT","Acceptée",1,"2015/03","",-0.5]
["ROBIN Kevin","2015-03-09","2015-03-23",0,"2015-03-23",0,"CP","Acceptée",1,"2015/03","",-7.0399999999999991]
["TAQUET Alain","2015-03-09","2015-05-04",0,"2015-05-07",0,"CP","Acceptée",4,"2015/05","",3.9600000000000009]
["DREZET Olivier","2015-03-10","2015-03-23",0,"2015-03-23",0,"RTT","Acceptée",1,"2015/03","",0.5]
["BERTHE Magali","2015-03-11","2015-07-13",0,"2015-07-13",0,"CP","Acceptée",1,"2015/07","",-8.43]
["POMMERELL Patrick","2015-03-12","2015-03-26",0.5,"2015-03-26",0,"RTT","Acceptée",0.5,"2015/03","Convocation tribunal",2.5]
["MARZOUK Sami","2015-03-12","2015-04-21",0,"2015-04-30",0,"CP","Acceptée",8,"2015/04","",-3.9999999999999147E-2]
["COUTANT Jean Paul","2015-03-13","2015-04-20",0,"2015-04-24",0,"CP","Acceptée",5,"2015/04","",7.9600000000000009]
["DREZET Olivier","2015-03-16","2015-03-17",0,"2015-03-17",0.5,"RTT","Acceptée",0.5,"2015/03","",0]
["DREZET Olivier","2015-03-16","2015-06-18",0,"2015-06-19",0,"CP","Acceptée",2,"2015/06","",2.4600000000000009]
["VAUTRAIN Franck","2015-03-16","2015-08-03",0,"2015-08-24",0,"CP","Acceptée",16,"2015/08","Congés eté 2015",-6.0399999999999991]
["SANTUCCI Lionel","2015-03-16","2015-07-27",0,"2015-08-13",0,"CP","Acceptée",14,"2015/07","Congés eté 2015",-6.0399999999999991]
["MARAIS Bernard","2015-03-17","2015-05-15",0,"2015-05-15",0,"CP","Acceptée",1,"2015/05","",1.9600000000000009]
["MARAIS Bernard","2015-03-17","2015-06-12",0,"2015-06-16",0,"CP","Acceptée",3,"2015/06","",-3.9999999999999147E-2]
["HEMLER Christelle","2015-03-18","2015-03-23",0,"2015-03-23",0,"CP","Acceptée",1,"2015/03","",8.4600000000000009]
["HAUTEBRANC Alexis","2015-03-19","2015-05-15",0,"2015-05-15",0,"CP","Acceptée",1,"2015/05","",1.9600000000000009]
["LEDANT Charles","2015-03-20","2015-04-13",0,"2015-04-13",0,"CP","Acceptée",1,"2015/04","",-3.9999999999999147E-2]
["LEDANT Charles","2015-03-20","2015-07-03",0,"2015-07-03",0,"Convention","Acceptée",0,"2015/07","Mariage Fils",-3.9999999999999147E-2]
["LEDANT Charles","2015-03-20","2015-07-06",0,"2015-07-06",0,"CP","Acceptée",1,"2015/07","",-3.9999999999999147E-2]
["VAUTRAIN Franck","2015-03-23","2015-03-26",0.5,"2015-03-26",0,"RTT","Acceptée",0.5,"2015/03","",1.5]
["SIODMAK Eric","2015-03-23","2015-03-25",0,"2015-03-25",0,"RTT","Annulée",0,"2015/03","Arret maladie",0.5]
["SIODMAK Eric","2015-03-23","2015-03-30",0,"2015-03-30",0,"CP","Annulée",0,"2015/03","Arret maladie",0.96000000000000085]
["GUERIN Viviane","2015-03-24","2015-05-22",0,"2015-05-22",0,"CP","Acceptée",1,"2015/05","",5.9600000000000009]
["LEDANT Charles","2015-03-24","2015-08-03",0,"2015-08-26",0,"CP","Acceptée",18,"2015/08","Congés eté 2015",-18.04]
["GUERIN Viviane","2015-03-24","2015-08-17",0,"2015-08-31",0,"CP","Acceptée",11,"2015/08","Congés eté 2015",-8.0399999999999991]
["GUERIN Viviane","2015-03-24","2015-09-01",0,"2015-09-04",0,"CP","Acceptée",4,"2015/09","Congés eté 2015"]
["POMMERELL Patrick","2015-03-25","2015-08-03",0,"2015-08-21",0,"CP","Acceptée",15,"2015/08","Congés eté 2015",-8.5399999999999991]
["SOUCHET Alain","2015-03-25","2015-04-13",0,"2015-04-13",0.5,"CP","Acceptée",0.5,"2015/04","",5.9600000000000009]
["SOUCHET Alain","2015-03-25","2015-05-13",0,"2015-05-18",0,"CP","Acceptée",3,"2015/05","",3.4600000000000009]
["SOUCHET Alain","2015-03-25","2015-04-20",0,"2015-04-20",0,"CP","Acceptée",1,"2015/04","",5.4600000000000009]
["SOUCHET Alain","2015-03-25","2015-04-30",0,"2015-04-30",0,"CP","Acceptée",1,"2015/04","",5.4600000000000009]
["VAUTRAIN Franck","2015-03-27","2015-04-10",0.5,"2015-04-10",0,"RTT","Acceptée",0.5,"2015/04","",1]
["ROBIN Kevin","2015-03-27","2015-04-17",0.5,"2015-04-20",0,"CP","Acceptée",1.5,"2015/04","",-8.5399999999999991]
["COUTANT Jean Paul","2015-03-27","2015-03-27",0,"2015-03-27",0,"CP","Acceptée",1,"2015/03","",6.9600000000000009]
["VAUTRAIN Franck","2015-03-30","2015-04-13",0,"2015-04-17",0,"CP","Acceptée",5,"2015/04","",4.9600000000000009]
["POMMERELL Patrick","2015-03-30","2015-04-15",0,"2015-04-15",0.5,"RTT","Acceptée",0.5,"2015/04","Opération chirurg. Swann",2]
["HAUTEBRANC Alexis","2015-04-01","2015-06-01",0,"2015-06-01",0,"CP","Acceptée",1,"2015/06","",0.96000000000000085]
["HAUTEBRANC Alexis","2015-04-09","2015-08-24",0,"2015-08-31",0,"CP","Acceptée",6,"2015/08","Congés eté 2015",-9.0399999999999991]
["HAUTEBRANC Alexis","2015-04-09","2015-09-01",0,"2015-09-07",0,"CP","Acceptée",5,"2015/09","Congés eté 2015"]
["CHEVALIER Yohan","2015-04-09","2015-05-15",0,"2015-05-15",0,"CP","Acceptée",1,"2015/05","",-7.4399999999999995]
["CHEVALIER Yohan","2015-04-09","2015-08-24",0,"2015-08-31",0,"CP","Acceptée",6,"2015/08","Congés eté 2015"]
["CHEVALIER Yohan","2015-04-09","2015-09-01",0,"2015-09-07",0,"CP","Acceptée",5,"2015/09","Congés eté 2015"]
["HAUTEBRANC Alexis","2015-04-14","2015-05-22",0,"2015-05-22",0,"CP","Acceptée",1,"2015/05","",0.96000000000000085]
["LOCATELLI Bruno","2015-04-14","2015-04-20",0,"2015-04-20",0,"CP","Acceptée",1,"2015/04","",4.9600000000000009]
["GUERIN Viviane","2015-04-14","2015-09-07",0,"2015-09-07",0,"RTD Recup","Acceptée",0,"2015/09","",""]
["DREVON Alain","2015-04-16","2015-04-17",0,"2015-04-17",0.5,"RTT","Acceptée",0.5,"2015/04","",2.5]
["LEDANT Charles","2015-04-17","2015-07-13",0,"2015-07-13",0,"CP","Acceptée",1,"2015/07","",-1.0399999999999991]
["LOCATELLI Bruno","2015-04-17","2015-05-15",0,"2015-05-15",0,"CP","Acceptée",1,"2015/05","",3.9600000000000009]
["LOCATELLI Bruno","2015-04-17","2015-05-26",0,"2015-05-29",0,"CP","Acceptée",4,"2015/05","",-3.9999999999999147E-2]
["TAQUET Alain","2015-04-20","2015-05-26",0,"2015-05-26",0,"CP","Acceptée",1,"2015/05","",1.9600000000000009]
["TAQUET Alain","2015-04-20","2015-07-13",0,"2015-07-13",0,"RTT","Acceptée",1,"2015/07","",2]
["HEMLER Christelle","2015-04-21","2015-04-27",0,"2015-04-28",0,"CP","Acceptée",2,"2015/04","",6.4600000000000009]
["DREVON Alain","2015-04-23","2015-04-27",0,"2015-04-27",0,"RTT","Acceptée",1,"2015/04","",1.5]
["DREVON Alain","2015-04-23","2015-04-30",0,"2015-04-30",0,"RTT","Acceptée",1,"2015/04","",1.5]
["BERTHE Magali","2015-04-23","2015-07-27",0,"2015-07-31",0,"CP","Acceptée",5,"2015/07","Congés eté 2015",-22.43]
["BERTHE Magali","2015-04-23","2015-08-01",0,"2015-08-16",0,"CP","Acceptée",10,"2015/08","Congés eté 2015"]
["SANTUCCI Lionel","2015-04-24","2015-05-04",0,"2015-05-15",0,"CP","Acceptée",8,"2015/05","",-3.9999999999999147E-2]
["SANTUCCI Lionel","2015-04-24","2015-05-18",0,"2015-05-19",0,"RTT","Acceptée",2,"2015/05","",0]
["GIRAUDON Alain","2015-04-27","2015-05-15",0,"2015-05-15",0,"RTT","Acceptée",1,"2015/05","",""]
["GIRAUDON Alain","2015-04-27","2015-07-13",0,"2015-07-13",0,"RTT","Acceptée",1,"2015/07","",""]
["MINAKIAN Mathilde","2015-04-27","2015-07-10",0,"2015-07-13",0,"CP","Acceptée",2,"2015/07"]
["DREVON Alain","2015-04-28","2015-04-24",0,"2015-04-24",0.5,"RTT","Acceptée",0.5,"2015/04","Régul. Absence vendredi matin",0]
["COUTANT Jean Paul","2015-04-30","2015-05-15",0,"2015-05-15",0,"RTT","Acceptée",1,"2015/05","",0]
["CHEVALIER Yohan","2015-05-04","2015-05-18",0,"2015-05-18",0,"CP","Acceptée",1,"2015/05","",-8.44]
["DEREPPE Bruno","2015-05-04","2015-05-15",0,"2015-05-15",0,"RTT","Acceptée",1,"2015/05","",1.5]
["BEARZATTO Giovanni","2015-05-04","2015-05-15",0,"2015-05-15",0,"RTT","Acceptée",1,"2015/05","",1]
["HAUTEBRANC Alexis","2015-05-04","2015-08-17",0,"2015-08-23",0,"CP","Acceptée",5,"2015/08","Congés eté 2015",-15.04]
["VAUTRAIN Franck","2015-05-05","2015-05-15",0,"2015-05-19",0,"CP","Acceptée",3,"2015/05","",1.9600000000000009]
["VAUTRAIN Franck","2015-05-05","2015-05-26",0,"2015-05-27",0,"CP","Acceptée",2,"2015/05","",2.9600000000000009]
["GUINOT Nathalie","2015-05-05","2015-05-15",0,"2015-05-15",0,"CP","Acceptée",1,"2015/05","",6.9600000000000009]
["HEMLER Christelle","2015-05-05","2015-05-11",0,"2015-05-11",0,"CP","Acceptée",1,"2015/05","",5.4600000000000009]
["PONS Olivier","2015-05-06","2015-05-15",0,"2015-05-15",0,"RTT","Acceptée",1,"2015/05","",2]
["DREVON Alain","2015-05-09","2015-05-15",0,"2015-05-15",0,"CP","Acceptée",1,"2015/05","",4.4600000000000009]
["DREVON Alain","2015-05-09","2015-05-19",0,"2015-05-19",0.5,"CP","Acceptée",0.5,"2015/05","Examens médicaux",4.9600000000000009]
["DREVON Alain","2015-05-09","2015-05-26",0,"2015-05-29",0,"CP","Acceptée",4,"2015/05","",1.4600000000000009]
["DEREPPE Bruno","2015-05-11","2015-05-26",0,"2015-05-29",0,"CP","Acceptée",4,"2015/05","",-3.9999999999999147E-2]
["COUTANT Jean Paul","2015-05-11","2015-05-20",0,"2015-05-20",0,"CP","Acceptée",1,"2015/05","",5.9600000000000009]
["DREZET Olivier","2015-05-11","2015-07-13",0,"2015-07-13",0,"CP","Acceptée",1,"2015/07","",3.4600000000000009]
["TAQUET Alain","2015-05-12","2015-05-21",0.5,"2015-05-21",0,"CP","Acceptée",0.5,"2015/05","",1.4600000000000009]
["GIRAUDON Alain","2015-05-13","2015-08-03",0,"2015-08-28",0,"CP","Acceptée",20,"2015/08","Congés eté 2015",-20.04]
["HEMLER Christelle","2015-05-13","2015-05-18",0,"2015-05-20",0,"CP","Acceptée",3,"2015/05","",2.4600000000000009]
["GUINOT Nathalie","2015-05-13","2015-08-10",0,"2015-08-28",0,"CP","Acceptée",15,"2015/08","Congés eté 2015",-13.04]
["DREZET Olivier","2015-05-13","2015-05-15",0,"2015-05-15",0,"CP","Acceptée",1,"2015/05","",3.4600000000000009]
["BEARZATTO Giovanni","2015-05-13","2015-05-29",0,"2015-05-29",0,"CP","Acceptée",1,"2015/05","",0.46000000000000085]
["MARZOUK Sami","2015-05-13","2015-08-03",0,"2015-08-28",0,"CP","Acceptée",20,"2015/08","Congés eté 2015",-20.04]
["HEMLER Christelle","2015-05-13","2015-05-26",0,"2015-05-27",0,"CP","Acceptée",2,"2015/05","",0.46000000000000085]
["POMMERELL Patrick","2015-05-14","2015-06-30",0,"2015-06-30",0,"RTT","Acceptée",1,"2015/06","Examen Elsa",1.5]
["GUINOT Nathalie","2015-05-18","2015-05-21",0,"2015-05-22",0,"CP","Acceptée",2,"2015/05","",-3.9999999999999147E-2]
["DREVON Alain","2015-05-18","2015-08-17",0,"2015-08-31",0,"CP","Acceptée",11,"2015/08","Congés eté 2015",-15.04]
["DREVON Alain","2015-05-18","2015-09-01",0,"2015-09-04",0,"CP","Acceptée",4,"2015/09","Congés eté 2016"]
["DREVON Alain","2015-05-18","2015-07-13",0,"2015-07-13",0,"CP","Acceptée",1,"2015/07",null,-1.0399999999999991]
["COUTANT Jean Paul","2015-05-19","2015-07-27",0,"2015-07-31",0,"CP","Acceptée",5,"2015/07","",0.96000000000000085]
["COUTANT Jean Paul","2015-05-19","2015-08-17",0,"2015-08-28",0,"CP","Acceptée",10,"2015/08","",-4.0399999999999991]
["DEREPPE Bruno","2015-05-19","2015-08-03",0,"2015-08-28",0,"CP","Acceptée",20,"2015/08","Congés été 2015",-20.04]
["GUIOT Fabien","2015-05-19","2015-05-26",0,"2015-05-26",0,"CP","Acceptée",1,"2015/05","",-3.9999999999999147E-2]
["GUIOT Fabien","2015-05-19","2015-07-27",0,"2015-07-31",0,"CP","Acceptée",5,"2015/07","Congés été 2015",-14.04]
["GUIOT Fabien","2015-05-19","2015-08-01",0,"2015-08-14",0,"CP","Acceptée",10,"2015/08","Congés été 2015"]
["DREZET Olivier","2015-05-20","2015-05-20",0.5,"2015-05-20",0,"RTT","Acceptée",0.5,"2015/05","",0]
["LANGE Sébastien","2015-05-20","2015-05-19",0,"2015-05-19",0.5,"CP","Acceptée",0.5,"2015/05","rendez vous eprso notaire",-1.5]
["LANGE Sébastien","2015-05-20","2015-07-27",0,"2015-07-31",0,"CP","Acceptée",5,"2015/07","CP",-6]
["LANGE Sébastien","2015-05-20","2015-08-10",0,"2015-08-21",0,"CP","Acceptée",10,"2015/08","CP",-11]
["TAQUET Alain","2015-05-20","2015-06-04",0.5,"2015-06-04",0,"CP","Acceptée",0.5,"2015/06","",0.96000000000000085]
["GUERIN Viviane","2015-05-21","2015-08-10",0,"2015-08-14",0,"CP","Acceptée",5,"2015/08","",0.96000000000000085]
["CHEVALIER Yohan","2015-05-22","2015-08-17",0,"2015-08-21",0,"CP","Acceptée",5,"2015/08","",-13.44]
["SOUCHET Alain","2015-05-22","2015-08-12",0,"2015-09-01",0,"CP","Acceptée",15,"2015/09","Congés été 2015"]
["COUTANT Jean Paul","2015-05-28","2015-06-03",0,"2015-06-03",0,"CP","Acceptée",1,"2015/06"]
["GUERIN Viviane","2015-05-29","2015-06-05",0,"2015-06-05",0,"RTT","Acceptée",1,"2015/06","",0]
["LOCATELLI Bruno","2015-06-01","2015-06-24",0,"2015-06-24",0,"RTT","Acceptée",1,"2015/06","",1]
["TAQUET Alain","2015-06-01","2015-06-25",0.5,"2015-06-25",0,"CP","Acceptée",0.5,"2015/06","",0.96000000000000085]
["SANTUCCI Lionel","2015-06-02","2015-06-04",0,"2015-06-04",0,"CP","Acceptée",1,"2015/06","",-1.0399999999999991]
["HEMLER Christelle","2015-06-03","2015-07-27",0,"2015-07-31",0,"CP","Acceptée",5,"2015/07","Congés été 2015",-9.5399999999999991]
["HEMLER Christelle","2015-06-03","2015-08-01",0,"2015-08-07",0,"CP","Acceptée",5,"2015/08","Congés été 2015"]
["HEMLER Christelle","2015-06-03","2015-08-31",0,"2015-08-31",0,"CP","Acceptée",1,"2015/08","Congés été 2015",-4.5399999999999991]
["HEMLER Christelle","2015-06-03","2015-09-01",0,"2015-09-04",0,"CP","Acceptée",4,"2015/09","Congés été 2015"]
["BERTHE Magali","2015-05-07","2015-05-15",0,"2015-05-15",0,"CP","Acceptée",1,"2015/05"]
["COUTANT Jean Paul","2015-06-05","2015-06-17",0,"2015-06-17",0,"CP","Acceptée",1,"2015/06","",17.96]
["POMMERELL Patrick","2015-06-08","2015-07-13",0,"2015-07-13",0,"RTT","Acceptée",1,"2015/07","",2]
["BEARZATTO Giovanni","2015-06-08","2015-06-22",0,"2015-06-22",0,"CP","Acceptée",1,"2015/06","Recup CP du 01/06/2015 annulé",28.46]
["PONS Olivier","2015-06-08","2015-08-07",0,"2015-08-24",0,"CP","Acceptée",12,"2015/08"]
["POMMERELL Patrick","2015-06-08","2015-06-17",0.5,"2015-06-17",0,"RTT","Acceptée",0.5,"2015/06","Bac Swann",2.5]
["POMMERELL Patrick","2015-06-08","2015-06-23",0,"2015-06-24",0.5,"CP","Acceptée",1.5,"2015/06","bac Swann",1.5]
["POMMERELL Patrick","2015-06-08","2015-07-15",0,"2015-07-17",0,"CP","Acceptée",3,"2015/07","",18.46]
["BEARZATTO Giovanni","2015-06-09","2015-07-13",0,"2015-07-13",0,"RTT","Acceptée",1,"2015/07","",1]
["SOUCHET Alain","2015-06-09","2015-07-13",0,"2015-07-13",0,"CP","Acceptée",1,"2015/07"]
["DREZET Olivier","2015-06-10","2015-06-29",0,"2015-06-29",0,"CP","Acceptée",1,"2015/06","",-0.5]
["TAQUET Alain","2015-06-17","2015-06-24",0.5,"2015-06-24",0,"CP","Acceptée",0.5,"2015/06","Solde CP N-1",25.96]
["TAQUET Alain","2015-06-22","2015-08-10",0,"2015-08-28",0,"CP","Acceptée",15,"2015/08","Congés été 2015",10.96]
["HAUTEBRANC Alexis","2015-06-23","2015-07-17",0,"2015-07-17",0,"RTT","Acceptée",1,"2015/07","",2]
["HAUTEBRANC Alexis","2015-06-23","2015-07-20",0,"2015-07-20",0,"RTT","Acceptée",1,"2015/07","",2]
["HAUTEBRANC Alexis","2015-06-23","2015-08-03",0,"2015-08-03",0,"RTT","Acceptée",1,"2015/08","",2]
["HAUTEBRANC Alexis","2015-06-23","2015-07-31",0,"2015-07-31",0,"CP","Acceptée",1,"2015/07","",9.9600000000000009]
["COUTANT Jean Paul","2015-06-24","2015-07-01",0.5,"2015-07-01",0,"CP","Acceptée",0.5,"2015/07","",17.46]
["LOCATELLI Bruno","2015-06-25","2015-07-13",0,"2015-07-13",0,"RTT","Acceptée",1,"2015/07","",0]
["POMMERELL Patrick","2015-07-01","2015-07-07",0.5,"2015-07-07",0,"CP","Acceptée",0.5,"2015/07","",16.46]
["MINAKIAN Mathilde","2015-07-01","2015-06-30",0,"2015-06-30",0.5,"CP","Acceptée",0.5,"2015/06"]
["MINAKIAN Mathilde","2015-07-01","2015-08-03",0,"2015-08-31",0,"CP","Acceptée",21,"2015/08","Congés été 2015"]
["TAQUET Alain","2015-07-01","2015-07-02",0,"2015-07-02",0.5,"RTT","Acceptée",0.5,"2015/07"]
["TAQUET Alain","2015-07-01","2015-07-09",0,"2015-07-09",0.5,"RTT","Acceptée",0.5,"2015/07"]
["GUINOT Nathalie","2015-07-03","2015-07-10",0,"2015-07-10",0,"RTT","Acceptée",1,"2015/07","",3.5]
["GUINOT Nathalie","2015-07-03","2015-07-16",0,"2015-07-17",0,"RTT","Acceptée",2,"2015/07","",2.5]
["GUINOT Nathalie","2015-07-03","2015-07-24",0,"2015-07-24",0,"RTT","Acceptée",1,"2015/07","",3.5]
["KADEM Christophe","2015-07-03","2015-07-13",0,"2015-07-13",0,"CP","Acceptée",1,"2015/07","",10.96]
["DEREPPE Bruno","2015-07-06","2015-07-13",0,"2015-07-13",0,"RTT","Acceptée",1,"2015/07","",0.5]
["HEMLER Christelle","2015-07-06","2015-07-13",0,"2015-07-13",0,"RTT","Acceptée",1,"2015/07","",1.5]
["HEMLER Christelle","2015-07-06","2015-07-20",0,"2015-07-20",0,"RTT","Acceptée",1,"2015/07","",1.5]
["HEMLER Christelle","2015-07-06","2015-07-21",0,"2015-07-21",0.5,"RTT","Acceptée",0.5,"2015/07","",""]
["PONS Olivier","2015-07-07","2015-07-13",0,"2015-07-13",0,"RTT","Acceptée",1,"2015/07","",1]
["PONS Olivier","2015-07-07","2015-08-06",0,"2015-08-06",0,"CP","Acceptée",1,"2015/08","Congés été 2015",12.96]
["PONS Olivier","2015-07-07","2015-08-24",0,"2015-08-25",0,"CP","Acceptée",2,"2015/08","Congés été 2015",11.96]
["LOYER Michel","2015-07-07","2015-08-03",0,"2015-08-21",0,"CP","Acceptée",15,"2015/08","",10.96]
["GUIOT Fabien","2015-07-07","2015-07-15",0,"2015-07-15",0,"RTT","Acceptée",1,"2015/07","",1]
["GUIOT Fabien","2015-07-07","2015-08-17",0,"2015-08-17",0,"RTT","Acceptée",1,"2015/08","",1]
["BEARZATTO Giovanni","2015-07-09","2015-08-17",0,"2015-08-31",0,"CP","Acceptée",11,"2015/08","Congés été 2015",17.46]
["BEARZATTO Giovanni","2015-07-09","2015-09-01",0,"2015-09-04",0,"CP","Acceptée",4,"2015/09","Congés été 2015",24.46]
["MARZOUK Sami","2015-07-10","2015-07-13",0,"2015-07-13",0,"RTT","Acceptée",1,"2015/07","",1]
["LEDANT Charles","2015-07-15","2015-07-10",0,"2015-07-10",0,"RTT","Acceptée",1,"2015/07","",1]
["COUTANT Jean Paul","2015-07-15","2015-07-13",0,"2015-07-13",0,"CP","Acceptée",1,"2015/07"]
["LOCATELLI Bruno","2015-07-16","2015-10-22",0,"2015-10-22",0,"CP","Acceptée",1,"2015/10","",10.96]
["TAQUET Alain","2015-07-17","2015-07-23",0.5,"2015-07-23",0,"RTT","Acceptée",0.5,"2015/07","",0.5]
["LOYER Michel","2015-07-21","2015-08-24",0,"2015-08-24",0,"RTT","Acceptée",1,"2015/08","",0]
["VAUTRAIN Franck","2015-07-24","2015-07-13",0.5,"2015-07-13",0,"RTT","Acceptée",0.5,"2015/07","",{"$error":"#VALUE!"}]
["DREZET Olivier","2015-07-27","2015-08-17",0,"2015-09-03",0,"CP","Acceptée",14,"2015/08","",13.46]
["DREZET Olivier","2015-07-27","2015-08-07",0,"2015-08-07",0,"CP","Acceptée",1,"2015/08","",26.46]
["TAQUET Alain","2015-07-30","2015-08-06",0.5,"2015-08-06",0,"RTT","Acceptée",0.5,"2015/08","",0]
["CHEVALIER Yohan","2015-08-03","2015-12-21",0,"2015-12-24",0,"Convention","Acceptée",0,"2015/12","Mariage",""]
["CHEVALIER Yohan","2015-08-03","2015-12-25",0,"2016-01-01",0,"CP","Acceptée",5,"2015/12","exc eptionnel -- mariage",-4.7399999999999984]
["GUERIN Viviane","2015-08-07","2015-10-02",0.5,"2015-10-02",0,"RTD Recup","En attente",0.5,"2015/10","annulé",""]
["SANTUCCI Lionel","2015-08-17","2015-08-14",0,"2015-08-14",0,"CP","Acceptée",1,"2015/08","",12.96]
["POMMERELL Patrick","2015-08-30","2015-09-01",0,"2015-09-01",0.5,"CP","Acceptée",0.5,"2015/09","",15.96]
["KADEM Christophe","2015-09-10","2015-10-19",0,"2015-10-20",0,"CP","Acceptée",2,"2015/10","",8.9600000000000009]
["BEARZATTO Giovanni","2015-09-14","2015-10-12",0,"2015-10-12",0,"CP","Acceptée",1,"2015/10","",12.46]
["GUINOT Nathalie","2015-09-14","2015-09-15",0,"2015-09-15",0.5,"RTT","Acceptée",0.5,"2015/09","",0]
["LOCATELLI Bruno","2015-09-16","2016-03-14",0,"2016-03-18",0,"CP","Acceptée",5,"2016/03","",5.9600000000000009]
["LOCATELLI Bruno","2015-09-16","2016-03-11",0,"2016-03-11",0,"Convention","Acceptée",0,"2016/03","Mariage de ma fille",""]
["DREVON Alain","2015-09-16","2015-09-22",0.5,"2015-09-22",0,"CP","Acceptée",0.5,"2015/09","",11.46]
["DREZET Olivier","2015-09-17","2015-12-23",0,"2015-12-24",0,"CP","Acceptée",2,"2015/12","",10.46]
["LOYER Michel","2015-09-17","2015-10-26",0,"2015-10-26",0,"CP","Acceptée",1,"2015/10","",9.9600000000000009]
["COUTANT Jean Paul","2015-09-22","2015-09-21",0,"2015-09-21",0,"CP","Acceptée",1,"2015/09","",15.46]
["HAUTEBRANC Alexis","2015-09-22","2015-10-15",0.5,"2015-10-16",0,"CP","Acceptée",1.5,"2015/10","",8.4600000000000009]
["SANTUCCI Lionel","2015-09-30","2015-10-09",0,"2015-10-09",0,"CP","Acceptée",1,"2015/10","",11.96]
["SANTUCCI Lionel","2015-09-30","2015-10-06",0,"2015-10-06",0,"CP","Acceptée",1,"2015/10","",11.96]
["KOSCIELNY Philippe","2015-10-06","2015-08-20",0,"2015-08-21",0,"CP","Acceptée",2,"2015/08","",-2]
["CHEVALIER Yohan","2015-10-07","2015-10-16",0,"2015-10-16",0,"CP","Acceptée",1,"2015/10","",-5.7399999999999984]
["MARZOUK Sami","2015-10-07","2015-10-06",0,"2015-10-06",0,"CP","Acceptée",1,"2015/10","",7.9600000000000009]
["GUERIN Viviane","2015-10-09","2015-11-20",0,"2015-11-20",0,"RTD Recup","Acceptée",0,"2015/11","",""]
["GUERIN Viviane","2015-10-09","2015-11-23",0,"2015-11-23",0,"RTD Recup","Acceptée",0,"2015/11","",""]
["SANTUCCI Lionel","2015-10-12","2015-10-13",0,"2015-10-13",0,"CP","Acceptée",1,"2015/10","",9.9600000000000009]
["COUTANT Jean Paul","2015-10-12","2015-11-04",0.5,"2015-11-04",0,"CP","Acceptée",0.5,"2015/11","",14.96]
["LOCATELLI Bruno","2015-10-19","2015-10-22",0,"2015-10-22",0,"CP","Annulée",-1,"2015/10","",6.9600000000000009]
["DREVON Alain","2015-10-20","2015-10-29",0,"2015-10-30",0,"CP","Acceptée",2,"2015/10","",9.4600000000000009]
["DREVON Alain","2015-10-21","2015-10-29",0.5,"2015-10-30",0,"CP","Annulée",-1.5,"2015/10","",12.96]
["DREZET Olivier","2015-10-22","2016-04-04",0,"2016-04-08",0,"CP","Acceptée",5,"2016/04","",5.4600000000000009]
["LEDANT Charles","2015-10-22","2015-11-04",0,"2015-11-04",0,"RTT","Acceptée",1,"2015/11","",0]
["GUERIN Viviane","2015-10-23","2015-12-23",0,"2015-12-24",0,"CP","Acceptée",2,"2015/12","",9.9600000000000009]
["HAUTEBRANC Alexis","2015-10-26","2015-11-12",0,"2015-11-12",0,"CP","Acceptée",1,"2015/11","",7.4600000000000009]
["POMMERELL Patrick","2015-11-04","2015-11-04",0.5,"2015-11-04",0,"CP","Acceptée",0.5,"2015/11","",15.46]
["POMMERELL Patrick","2015-11-04","2015-11-06",0.5,"2015-11-06",0,"CP","Acceptée",0.5,"2015/11","",15.46]
["POMMERELL Patrick","2015-11-04","2015-12-28",0,"2015-12-29",0,"CP","Acceptée",2,"2015/12","",13.96]
["GUIOT Fabien","2015-11-05","2015-11-06",0.5,"2015-11-06",0,"CP","Acceptée",0.5,"2015/11","",10.46]
["TAQUET Alain","2015-11-05","2015-12-28",0,"2015-12-28",0,"CP","Acceptée",1,"2015/12","",9.9600000000000009]
["SOUCHET Alain","2015-11-06","2015-12-24",0,"2015-12-24",0,"CP","Acceptée",1,"2015/12","",12.96]
["DREVON Alain","2015-11-06","2015-11-09",0,"2015-11-10",0,"CP","Acceptée",2,"2015/11","",8.9600000000000009]
["DREVON Alain","2015-11-08","2015-11-09",0.5,"2015-11-09",0,"CP","Annulée",-0.5,"2015/11"]
["DEREPPE Bruno","2015-11-09","2015-11-13",0,"2015-11-13",0,"CP","Acceptée",1,"2015/11","",6.9600000000000009]
["GUINOT Nathalie","2015-11-12","2016-02-22",0,"2016-02-26",0,"CP","Acceptée",5,"2016/02","",4.9600000000000009]
["DREVON Alain","2015-11-12","2015-11-27",0.5,"2015-11-27",0,"CP","Acceptée",0.5,"2015/11","",8.9600000000000009]
["LEDANT Charles","2015-11-12","2015-12-24",0,"2015-12-24",0,"CP","Acceptée",1,"2015/12","",7.9600000000000009]
["LEDANT Charles","2015-11-12","2015-12-28",0,"2015-12-28",0,"CP","Acceptée",1,"2015/12","",7.9600000000000009]
["LEDANT Charles","2015-11-12","2015-12-31",0,"2015-12-31",0,"CP","Acceptée",1,"2015/12","",7.9600000000000009]
["BERTHE Magali","2015-11-16","2015-11-20",0.5,"2015-11-20",0,"RTD Recup","Acceptée",0,"2015/11","",""]
["HAUTEBRANC Alexis","2015-11-16","2015-12-24",0.5,"2015-12-24",0,"CP","Acceptée",0.5,"2015/12","",6.9600000000000009]
["HAUTEBRANC Alexis","2015-11-16","2015-12-30",0,"2015-12-31",0,"CP","En attente",2,"2015/12","",5.4600000000000009]
["POMMERELL Patrick","2015-11-16","2015-11-18",0.5,"2015-11-18",0,"CP","Acceptée",0.5,"2015/11","",12.46]

{"sheet":"Personnel","index":5,"n_rows":35,"n_cols":29,"rows_kept":35,"cut":false,"hidden":false,"merged":[[0,15,0,16],[0,18,0,19]]}
["Nombre de jours/mois",2.08,null,null,null,null,"CP Période du",{"$f":"DATE(ANNEE_LSE,6,1)","v":"2015-06-01"},"au",{"$f":"DATE(ANNEE_LSE+1,5,31)","v":"2016-05-31"},null,{"$f":"(H1-F4)/365/5","v":3.4526027397260273},null,null,"RTT Période du","2015-01-01",null,"au","2015-12-31",null,null,null,null,null,"=ARRONDI.AU.MULTIPLE(Personnel!$M4*SOMME(Personnel!$N4:$Z4);0,5)",null,null,null,"2013-01-01"]
["TOTAUX",null,null,null,null,null,null,{"$f":"SUBTOTAL(9,Personnel!$H$4:$H$35)","v":-1.6999999999999993},{"$f":"SUBTOTAL(9,Personnel!$I$4:$I$35)","v":55},{"$f":"SUBTOTAL(9,Personnel!$J$4:$J$35)","v":780.74600000000021},null,{"$f":"SUBTOTAL(9,Personnel!$L$4:$L$35)","v":525.5}]
["Salarié","Sorti","User","Société","Agence","entrée","Coef","Solde N-1","ancienneté","Acquis N-1","Acquis N","Pris","RTT","RTT Solde N-1","Janv","Févr","Mars","Avril","Mai","Juin","Juillet","Aout","Sept","Oct","Nov","Déc","RTT Droits","RTT Pris","RTT Solde"]
["BEARZATTO Giovanni",null,"g.bearzatto","LSE","IDF","1998-03-01",1,1.5,{"$f":"IF(YEAR(PERSONNEL[[#This Row],[entrée]])=YEAR(CPdeb),0,MIN(4,INT((CPdeb-PERSONNEL[[#This Row],[entrée]])/365/5)))","v":3},{"$f":"$H4+$I4+IF($H$1-$F4<=0,0,IF($H$1-$F4>364,NbjCP*12*$G4,CEILING(($H$1-$F4)/30*$G4*NbjCP,0.01)))","v":29.46},10.4,{"$f":"SUMIFS(Tabsaisies[NB jours],Tabsaisies[Salarié],Personnel!$A4,Tabsaisies[Nature],\"CP\",Tabsaisies[Statut],\"Acceptée\",Tabsaisies[Début],\">=\"&$H$1,Tabsaisies[Fin],\"<=\"&$J$1)","v":17},1,3,0.67,0.67,0.67,null,null,null,null,null,null,null,null,null,{"$f":"MROUND(Personnel!$M4*SUM(Personnel!$N4:$Z4),0.5)","v":5},{"$f":"SUMIFS(Tabsaisies[NB jours],Tabsaisies[Salarié],Personnel!$A4,Tabsaisies[Nature],\"RTT\",Tabsaisies[Statut],\"Acceptée\",Tabsaisies[Début],\">=\"&$P$1)","v":5},{"$f":"PERSONNEL[[#This Row],[RTT Droits]]-PERSONNEL[[#This Row],[RTT Pris]]","v":0}]
["BERTHE Magali",null,"m.berthe","LSE","SUD","2013-12-09",1,-8,{"$f":"IF(YEAR(PERSONNEL[[#This Row],[entrée]])=YEAR(CPdeb),0,MIN(4,INT((CPdeb-PERSONNEL[[#This Row],[entrée]])/365/5)))","v":0},16.96,10.4,{"$f":"SUMIFS(Tabsaisies[NB jours],Tabsaisies[Salarié],Personnel!$A5,Tabsaisies[Nature],\"CP\",Tabsaisies[Statut],\"Acceptée\",Tabsaisies[Début],\">=\"&$H$1,Tabsaisies[Fin],\"<=\"&$J$1)","v":16},0,0,0.67,0.67,0.67,null,null,null,null,null,null,null,null,null,{"$f":"MROUND(Personnel!$M5*SUM(Personnel!$N5:$Z5),0.5)","v":0},{"$f":"SUMIFS(Tabsaisies[NB jours],Tabsaisies[Salarié],Personnel!$A5,Tabsaisies[Nature],\"RTT\",Tabsaisies[Statut],\"Acceptée\",Tabsaisies[Début],\">=\"&$P$1)","v":0},{"$f":"PERSONNEL[[#This Row],[RTT Droits]]-PERSONNEL[[#This Row],[RTT Pris]]","v":0}]
["BABOULIN Marine",null,"m.baboulin","LSE","SUD","2015-10-22",1,null,{"$f":"IF(YEAR(PERSONNEL[[#This Row],[entrée]])=YEAR(CPdeb),0,MIN(4,INT((CPdeb-PERSONNEL[[#This Row],[entrée]])/365/5)))","v":0},0,0,{"$f":"SUMIFS(Tabsaisies[NB jours],Tabsaisies[Salarié],Personnel!$A6,Tabsaisies[Nature],\"CP\",Tabsaisies[Statut],\"Acceptée\",Tabsaisies[Début],\">=\"&$H$1,Tabsaisies[Fin],\"<=\"&$J$1)","v":0},0,0,null,null,null,null,null,null,null,null,null,null,null,null,{"$f":"MROUND(Personnel!$M6*SUM(Personnel!$N6:$Z6),0.5)","v":0},{"$f":"SUMIFS(Tabsaisies[NB jours],Tabsaisies[Salarié],Personnel!$A6,Tabsaisies[Nature],\"RTT\",Tabsaisies[Statut],\"Acceptée\",Tabsaisies[Début],\">=\"&$P$1)","v":0},{"$f":"PERSONNEL[[#This Row],[RTT Droits]]-PERSONNEL[[#This Row],[RTT Pris]]","v":0}]
["CHEVALIER Yohan",null,"y.chevalier","LSE","SUD","2014-02-12",1,-8.6999999999999993,{"$f":"IF(YEAR(PERSONNEL[[#This Row],[entrée]])=YEAR(CPdeb),0,MIN(4,INT((CPdeb-PERSONNEL[[#This Row],[entrée]])/365/5)))","v":0},16.260000000000002,10.4,{"$f":"SUMIFS(Tabsaisies[NB jours],Tabsaisies[Salarié],Personnel!$A7,Tabsaisies[Nature],\"CP\",Tabsaisies[Statut],\"Acceptée\",Tabsaisies[Début],\">=\"&$H$1,Tabsaisies[Fin],\"<=\"&$J$1)","v":22},0,0,0.67,0.67,0.67,null,null,null,null,null,null,null,null,null,{"$f":"MROUND(Personnel!$M7*SUM(Personnel!$N7:$Z7),0.5)","v":0},{"$f":"SUMIFS(Tabsaisies[NB jours],Tabsaisies[Salarié],Personnel!$A7,Tabsaisies[Nature],\"RTT\",Tabsaisies[Statut],\"Acceptée\",Tabsaisies[Début],\">=\"&$P$1)","v":0},{"$f":"PERSONNEL[[#This Row],[RTT Droits]]-PERSONNEL[[#This Row],[RTT Pris]]","v":0}]
["COUTANT Jean Paul",null,"jp.coutant","LSE","IDF","1994-01-01",1,6,{"$f":"IF(YEAR(PERSONNEL[[#This Row],[entrée]])=YEAR(CPdeb),0,MIN(4,INT((CPdeb-PERSONNEL[[#This Row],[entrée]])/365/5)))","v":4},34.96,10.4,{"$f":"SUMIFS(Tabsaisies[NB jours],Tabsaisies[Salarié],Personnel!$A8,Tabsaisies[Nature],\"CP\",Tabsaisies[Statut],\"Acceptée\",Tabsaisies[Début],\">=\"&$H$1,Tabsaisies[Fin],\"<=\"&$J$1)","v":20},1,2,0.67,0.67,0.67,null,null,null,null,null,null,null,null,null,{"$f":"MROUND(Personnel!$M8*SUM(Personnel!$N8:$Z8),0.5)","v":4},{"$f":"SUMIFS(Tabsaisies[NB jours],Tabsaisies[Salarié],Personnel!$A8,Tabsaisies[Nature],\"RTT\",Tabsaisies[Statut],\"Acceptée\",Tabsaisies[Début],\">=\"&$P$1)","v":4},{"$f":"PERSONNEL[[#This Row],[RTT Droits]]-PERSONNEL[[#This Row],[RTT Pris]]","v":0}]
["DEREPPE Bruno",null,"b.dereppe","LSE","IDF","1999-05-01",1,0,{"$f":"IF(YEAR(PERSONNEL[[#This Row],[entrée]])=YEAR(CPdeb),0,MIN(4,INT((CPdeb-PERSONNEL[[#This Row],[entrée]])/365/5)))","v":3},27.96,10.4,{"$f":"SUMIFS(Tabsaisies[NB jours],Tabsaisies[Salarié],Personnel!$A9,Tabsaisies[Nature],\"CP\",Tabsaisies[Statut],\"Acceptée\",Tabsaisies[Début],\">=\"&$H$1,Tabsaisies[Fin],\"<=\"&$J$1)","v":21},1,1.5,0.67,0.67,0.67,null,null,null,null,null,null,null,null,null,{"$f":"MROUND(Personnel!$M9*SUM(Personnel!$N9:$Z9),0.5)","v":3.5},{"$f":"SUMIFS(Tabsaisies[NB jours],Tabsaisies[Salarié],Personnel!$A9,Tabsaisies[Nature],\"RTT\",Tabsaisies[Statut],\"Acceptée\",Tabsaisies[Début],\">=\"&$P$1)","v":3},{"$f":"PERSONNEL[[#This Row],[RTT Droits]]-PERSONNEL[[#This Row],[RTT Pris]]","v":0.5}]
["DREVON Alain",null,"a.drevon","LSE","SUD","1997-01-01",1,0,{"$f":"IF(YEAR(PERSONNEL[[#This Row],[entrée]])=YEAR(CPdeb),0,MIN(4,INT((CPdeb-PERSONNEL[[#This Row],[entrée]])/365/5)))","v":3},27.96,{"$f":"IF($F4<$H$1,INT((TODAY()-$H$1)/30)*NbjCP*$G4,INT((TODAY()-$F4)/30)*NbjCP*$G4)","v":10.4},{"$f":"SUMIFS(Tabsaisies[NB jours],Tabsaisies[Salarié],Personnel!$A10,Tabsaisies[Nature],\"CP\",Tabsaisies[Statut],\"Acceptée\",Tabsaisies[Début],\">=\"&$H$1,Tabsaisies[Fin],\"<=\"&$J$1)","v":21},1,2,0.67,0.67,0.67,null,null,null,null,null,null,null,null,null,{"$f":"MROUND(Personnel!$M10*SUM(Personnel!$N10:$Z10),0.5)","v":4},{"$f":"SUMIFS(Tabsaisies[NB jours],Tabsaisies[Salarié],Personnel!$A10,Tabsaisies[Nature],\"RTT\",Tabsaisies[Statut],\"Acceptée\",Tabsaisies[Début],\">=\"&$P$1)","v":4},{"$f":"PERSONNEL[[#This Row],[RTT Droits]]-PERSONNEL[[#This Row],[RTT Pris]]","v":0}]
["DREZET Olivier",null,"olivier.drezet","LSE","IDF","1995-10-01",1,3.5,{"$f":"IF(YEAR(PERSONNEL[[#This Row],[entrée]])=YEAR(CPdeb),0,MIN(4,INT((CPdeb-PERSONNEL[[#This Row],[entrée]])/365/5)))","v":3},31.46,10.4,{"$f":"SUMIFS(Tabsaisies[NB jours],Tabsaisies[Salarié],Personnel!$A11,Tabsaisies[Nature],\"CP\",Tabsaisies[Statut],\"Acceptée\",Tabsaisies[Début],\">=\"&$H$1,Tabsaisies[Fin],\"<=\"&$J$1)","v":26},1,2,0.67,0.67,0.67,null,null,null,null,null,null,null,null,null,{"$f":"MROUND(Personnel!$M11*SUM(Personnel!$N11:$Z11),0.5)","v":4},{"$f":"SUMIFS(Tabsaisies[NB jours],Tabsaisies[Salarié],Personnel!$A11,Tabsaisies[Nature],\"RTT\",Tabsaisies[Statut],\"Acceptée\",Tabsaisies[Début],\">=\"&$P$1)","v":4},{"$f":"PERSONNEL[[#This Row],[RTT Droits]]-PERSONNEL[[#This Row],[RTT Pris]]","v":0}]
["GIRAUDON Alain",null,"a.giraudon","LSE","IDF","2008-04-01",1,0,{"$f":"IF(YEAR(PERSONNEL[[#This Row],[entrée]])=YEAR(CPdeb),0,MIN(4,INT((CPdeb-PERSONNEL[[#This Row],[entrée]])/365/5)))","v":1},25.96,0,{"$f":"SUMIFS(Tabsaisies[NB jours],Tabsaisies[Salarié],Personnel!$A12,Tabsaisies[Nature],\"CP\",Tabsaisies[Statut],\"Acceptée\",Tabsaisies[Début],\">=\"&$H$1,Tabsaisies[Fin],\"<=\"&$J$1)","v":20},1,2.5,0.67,0.67,0.67,null,null,null,null,null,null,null,null,null,{"$f":"MROUND(Personnel!$M12*SUM(Personnel!$N12:$Z12),0.5)","v":4.5},{"$f":"SUMIFS(Tabsaisies[NB jours],Tabsaisies[Salarié],Personnel!$A12,Tabsaisies[Nature],\"RTT\",Tabsaisies[Statut],\"Acceptée\",Tabsaisies[Début],\">=\"&$P$1)","v":4.5},{"$f":"PERSONNEL[[#This Row],[RTT Droits]]-PERSONNEL[[#This Row],[RTT Pris]]","v":0}]
["GUERIN Viviane",null,"v.guerin","LSE","SUD","2005-03-01",1,6,{"$f":"IF(YEAR(PERSONNEL[[#This Row],[entrée]])=YEAR(CPdeb),0,MIN(4,INT((CPdeb-PERSONNEL[[#This Row],[entrée]])/365/5)))","v":2},32.96,10.4,{"$f":"SUMIFS(Tabsaisies[NB jours],Tabsaisies[Salarié],Personnel!$A13,Tabsaisies[Nature],\"CP\",Tabsaisies[Statut],\"Acceptée\",Tabsaisies[Début],\">=\"&$H$1,Tabsaisies[Fin],\"<=\"&$J$1)","v":23},1,3,0.67,0.67,0.67,null,null,null,null,null,null,null,null,null,{"$f":"MROUND(Personnel!$M13*SUM(Personnel!$N13:$Z13),0.5)","v":5},{"$f":"SUMIFS(Tabsaisies[NB jours],Tabsaisies[Salarié],Personnel!$A13,Tabsaisies[Nature],\"RTT\",Tabsaisies[Statut],\"Acceptée\",Tabsaisies[Début],\">=\"&$P$1)","v":5},{"$f":"PERSONNEL[[#This Row],[RTT Droits]]-PERSONNEL[[#This Row],[RTT Pris]]","v":0}]
["GUINOT Nathalie",null,"n.guinot","LSE","IDF","2010-09-01",1,0,{"$f":"IF(YEAR(PERSONNEL[[#This Row],[entrée]])=YEAR(CPdeb),0,MIN(4,INT((CPdeb-PERSONNEL[[#This Row],[entrée]])/365/5)))","v":0},24.96,10.4,{"$f":"SUMIFS(Tabsaisies[NB jours],Tabsaisies[Salarié],Personnel!$A14,Tabsaisies[Nature],\"CP\",Tabsaisies[Statut],\"Acceptée\",Tabsaisies[Début],\">=\"&$H$1,Tabsaisies[Fin],\"<=\"&$J$1)","v":20},1,3.5,0.67,0.67,0.67,null,null,null,null,null,null,null,null,null,{"$f":"MROUND(Personnel!$M14*SUM(Personnel!$N14:$Z14),0.5)","v":5.5},{"$f":"SUMIFS(Tabsaisies[NB jours],Tabsaisies[Salarié],Personnel!$A14,Tabsaisies[Nature],\"RTT\",Tabsaisies[Statut],\"Acceptée\",Tabsaisies[Début],\">=\"&$P$1)","v":5.5},{"$f":"PERSONNEL[[#This Row],[RTT Droits]]-PERSONNEL[[#This Row],[RTT Pris]]","v":0}]
["GUIOT Fabien",null,"f.guiot","LSE","IDF","2010-02-01",1,0,{"$f":"IF(YEAR(PERSONNEL[[#This Row],[entrée]])=YEAR(CPdeb),0,MIN(4,INT((CPdeb-PERSONNEL[[#This Row],[entrée]])/365/5)))","v":1},25.96,10.4,{"$f":"SUMIFS(Tabsaisies[NB jours],Tabsaisies[Salarié],Personnel!$A15,Tabsaisies[Nature],\"CP\",Tabsaisies[Statut],\"Acceptée\",Tabsaisies[Début],\">=\"&$H$1,Tabsaisies[Fin],\"<=\"&$J$1)","v":15.5},1,2,0.67,0.67,0.67,null,null,null,null,null,null,null,null,null,{"$f":"MROUND(Personnel!$M15*SUM(Personnel!$N15:$Z15),0.5)","v":4},{"$f":"SUMIFS(Tabsaisies[NB jours],Tabsaisies[Salarié],Personnel!$A15,Tabsaisies[Nature],\"RTT\",Tabsaisies[Statut],\"Acceptée\",Tabsaisies[Début],\">=\"&$P$1)","v":4},{"$f":"PERSONNEL[[#This Row],[RTT Droits]]-PERSONNEL[[#This Row],[RTT Pris]]","v":0}]
["HAUTEBRANC Alexis",null,"a.hautebranc","LSE","SUD","2005-06-01",1,1,{"$f":"IF(YEAR(PERSONNEL[[#This Row],[entrée]])=YEAR(CPdeb),0,MIN(4,INT((CPdeb-PERSONNEL[[#This Row],[entrée]])/365/5)))","v":2},27.96,10.4,{"$f":"SUMIFS(Tabsaisies[NB jours],Tabsaisies[Salarié],Personnel!$A16,Tabsaisies[Nature],\"CP\",Tabsaisies[Statut],\"Acceptée\",Tabsaisies[Début],\">=\"&$H$1,Tabsaisies[Fin],\"<=\"&$J$1)","v":21},1,2,0.67,0.67,0.67,null,null,null,null,null,null,null,null,null,{"$f":"MROUND(Personnel!$M16*SUM(Personnel!$N16:$Z16),0.5)","v":4},{"$f":"SUMIFS(Tabsaisies[NB jours],Tabsaisies[Salarié],Personnel!$A16,Tabsaisies[Nature],\"RTT\",Tabsaisies[Statut],\"Acceptée\",Tabsaisies[Début],\">=\"&$P$1)","v":4},{"$f":"PERSONNEL[[#This Row],[RTT Droits]]-PERSONNEL[[#This Row],[RTT Pris]]","v":0}]
["HEMLER Christelle",null,"c.hemler","LSE","IDF","2008-10-01",1,0.5,{"$f":"IF(YEAR(PERSONNEL[[#This Row],[entrée]])=YEAR(CPdeb),0,MIN(4,INT((CPdeb-PERSONNEL[[#This Row],[entrée]])/365/5)))","v":1},26.46,10.4,{"$f":"SUMIFS(Tabsaisies[NB jours],Tabsaisies[Salarié],Personnel!$A17,Tabsaisies[Nature],\"CP\",Tabsaisies[Statut],\"Acceptée\",Tabsaisies[Début],\">=\"&$H$1,Tabsaisies[Fin],\"<=\"&$J$1)","v":15},1,2,0.67,0.67,0.67,null,null,null,null,null,null,null,null,null,{"$f":"MROUND(Personnel!$M17*SUM(Personnel!$N17:$Z17),0.5)","v":4},{"$f":"SUMIFS(Tabsaisies[NB jours],Tabsaisies[Salarié],Personnel!$A17,Tabsaisies[Nature],\"RTT\",Tabsaisies[Statut],\"Acceptée\",Tabsaisies[Début],\">=\"&$P$1)","v":4},{"$f":"PERSONNEL[[#This Row],[RTT Droits]]-PERSONNEL[[#This Row],[RTT Pris]]","v":0}]
["KADEM Christophe",null,"c.kadem","LSE","NO","2007-11-01",1,1,{"$f":"IF(YEAR(PERSONNEL[[#This Row],[entrée]])=YEAR(CPdeb),0,MIN(4,INT((CPdeb-PERSONNEL[[#This Row],[entrée]])/365/5)))","v":1},26.96,10.4,{"$f":"SUMIFS(Tabsaisies[NB jours],Tabsaisies[Salarié],Personnel!$A18,Tabsaisies[Nature],\"CP\",Tabsaisies[Statut],\"Acceptée\",Tabsaisies[Début],\">=\"&$H$1,Tabsaisies[Fin],\"<=\"&$J$1)","v":18},1,1,0.67,0.67,0.67,null,null,null,null,null,null,null,null,null,{"$f":"MROUND(Personnel!$M18*SUM(Personnel!$N18:$Z18),0.5)","v":3},{"$f":"SUMIFS(Tabsaisies[NB jours],Tabsaisies[Salarié],Personnel!$A18,Tabsaisies[Nature],\"RTT\",Tabsaisies[Statut],\"Acceptée\",Tabsaisies[Début],\">=\"&$P$1)","v":3},{"$f":"PERSONNEL[[#This Row],[RTT Droits]]-PERSONNEL[[#This Row],[RTT Pris]]","v":0}]
["KOSCIELNY Philippe",null,"p.koscielny","LSE ","IDF","2015-07-01",1,null,{"$f":"IF(YEAR(PERSONNEL[[#This Row],[entrée]])=YEAR(CPdeb),0,MIN(4,INT((CPdeb-PERSONNEL[[#This Row],[entrée]])/365/5)))","v":0},0,10.4,{"$f":"SUMIFS(Tabsaisies[NB jours],Tabsaisies[Salarié],Personnel!$A19,Tabsaisies[Nature],\"CP\",Tabsaisies[Statut],\"Acceptée\",Tabsaisies[Début],\">=\"&$H$1,Tabsaisies[Fin],\"<=\"&$J$1)","v":2},null,null,null,null,null,null,null,null,null,null,null,null,null,null,{"$f":"MROUND(Personnel!$M19*SUM(Personnel!$N19:$Z19),0.5)","v":0},{"$f":"SUMIFS(Tabsaisies[NB jours],Tabsaisies[Salarié],Personnel!$A19,Tabsaisies[Nature],\"RTT\",Tabsaisies[Statut],\"Acceptée\",Tabsaisies[Début],\">=\"&$P$1)","v":0},{"$f":"PERSONNEL[[#This Row],[RTT Droits]]-PERSONNEL[[#This Row],[RTT Pris]]","v":0}]
["LANGE Sébastien",null,"s.lange","LSE","SUD","2014-11-17",1,-1.5,{"$f":"IF(YEAR(PERSONNEL[[#This Row],[entrée]])=YEAR(CPdeb),0,MIN(4,INT((CPdeb-PERSONNEL[[#This Row],[entrée]])/365/5)))","v":0},12.09,10.4,{"$f":"SUMIFS(Tabsaisies[NB jours],Tabsaisies[Salarié],Personnel!$A20,Tabsaisies[Nature],\"CP\",Tabsaisies[Statut],\"Acceptée\",Tabsaisies[Début],\">=\"&$H$1,Tabsaisies[Fin],\"<=\"&$J$1)","v":15},0,null,0.67,0.67,0.67,null,null,null,null,null,null,null,null,null,{"$f":"MROUND(Personnel!$M20*SUM(Personnel!$N20:$Z20),0.5)","v":0},{"$f":"SUMIFS(Tabsaisies[NB jours],Tabsaisies[Salarié],Personnel!$A20,Tabsaisies[Nature],\"RTT\",Tabsaisies[Statut],\"Acceptée\",Tabsaisies[Début],\">=\"&$P$1)","v":0},{"$f":"PERSONNEL[[#This Row],[RTT Droits]]-PERSONNEL[[#This Row],[RTT Pris]]","v":0}]
["LEDANT Charles",null,"c.ledant","LSE","SUD","1983-11-01",1,0,{"$f":"IF(YEAR(PERSONNEL[[#This Row],[entrée]])=YEAR(CPdeb),0,MIN(4,INT((CPdeb-PERSONNEL[[#This Row],[entrée]])/365/5)))","v":4},28.96,10.4,{"$f":"SUMIFS(Tabsaisies[NB jours],Tabsaisies[Salarié],Personnel!$A21,Tabsaisies[Nature],\"CP\",Tabsaisies[Statut],\"Acceptée\",Tabsaisies[Début],\">=\"&$H$1,Tabsaisies[Fin],\"<=\"&$J$1)","v":23},1,2,0.67,0.67,0.67,null,null,null,null,null,null,null,null,null,{"$f":"MROUND(Personnel!$M21*SUM(Personnel!$N21:$Z21),0.5)","v":4},{"$f":"SUMIFS(Tabsaisies[NB jours],Tabsaisies[Salarié],Personnel!$A21,Tabsaisies[Nature],\"RTT\",Tabsaisies[Statut],\"Acceptée\",Tabsaisies[Début],\">=\"&$P$1)","v":4},{"$f":"PERSONNEL[[#This Row],[RTT Droits]]-PERSONNEL[[#This Row],[RTT Pris]]","v":0}]
["LOCATELLI Bruno",null,"b.locatelli","LSE","SUD","1989-08-01",1,0,{"$f":"IF(YEAR(PERSONNEL[[#This Row],[entrée]])=YEAR(CPdeb),0,MIN(4,INT((CPdeb-PERSONNEL[[#This Row],[entrée]])/365/5)))","v":4},28.96,10.4,{"$f":"SUMIFS(Tabsaisies[NB jours],Tabsaisies[Salarié],Personnel!$A22,Tabsaisies[Nature],\"CP\",Tabsaisies[Statut],\"Acceptée\",Tabsaisies[Début],\">=\"&$H$1,Tabsaisies[Fin],\"<=\"&$J$1)","v":23},1,3,0.67,0.67,0.67,null,null,null,null,null,null,null,null,null,{"$f":"MROUND(Personnel!$M22*SUM(Personnel!$N22:$Z22),0.5)","v":5},{"$f":"SUMIFS(Tabsaisies[NB jours],Tabsaisies[Salarié],Personnel!$A22,Tabsaisies[Nature],\"RTT\",Tabsaisies[Statut],\"Acceptée\",Tabsaisies[Début],\">=\"&$P$1)","v":5},{"$f":"PERSONNEL[[#This Row],[RTT Droits]]-PERSONNEL[[#This Row],[RTT Pris]]","v":0}]
["LOYER Michel",null,"m.loyer","LSE","NO","2006-12-01",1,0,{"$f":"IF(YEAR(PERSONNEL[[#This Row],[entrée]])=YEAR(CPdeb),0,MIN(4,INT((CPdeb-PERSONNEL[[#This Row],[entrée]])/365/5)))","v":1},25.96,10.4,{"$f":"SUMIFS(Tabsaisies[NB jours],Tabsaisies[Salarié],Personnel!$A23,Tabsaisies[Nature],\"CP\",Tabsaisies[Statut],\"Acceptée\",Tabsaisies[Début],\">=\"&$H$1,Tabsaisies[Fin],\"<=\"&$J$1)","v":16},1,2,0.67,0.67,0.67,null,null,null,null,null,null,null,null,null,{"$f":"MROUND(Personnel!$M23*SUM(Personnel!$N23:$Z23),0.5)","v":4},{"$f":"SUMIFS(Tabsaisies[NB jours],Tabsaisies[Salarié],Personnel!$A23,Tabsaisies[Nature],\"RTT\",Tabsaisies[Statut],\"Acceptée\",Tabsaisies[Début],\">=\"&$P$1)","v":4},{"$f":"PERSONNEL[[#This Row],[RTT Droits]]-PERSONNEL[[#This Row],[RTT Pris]]","v":0}]
["MARAIS Bernard",null,"b.marais","OBI","SUD","1985-08-01",1,-2,{"$f":"IF(YEAR(PERSONNEL[[#This Row],[entrée]])=YEAR(CPdeb),0,MIN(4,INT((CPdeb-PERSONNEL[[#This Row],[entrée]])/365/5)))","v":4},26.96,10.4,{"$f":"SUMIFS(Tabsaisies[NB jours],Tabsaisies[Salarié],Personnel!$A24,Tabsaisies[Nature],\"CP\",Tabsaisies[Statut],\"Acceptée\",Tabsaisies[Début],\">=\"&$H$1,Tabsaisies[Fin],\"<=\"&$J$1)","v":18},0,0,0.67,0.67,0.67,null,null,null,null,null,null,null,null,null,{"$f":"MROUND(Personnel!$M24*SUM(Personnel!$N24:$Z24),0.5)","v":0},{"$f":"SUMIFS(Tabsaisies[NB jours],Tabsaisies[Salarié],Personnel!$A24,Tabsaisies[Nature],\"RTT\",Tabsaisies[Statut],\"Acceptée\",Tabsaisies[Début],\">=\"&$P$1)","v":0},{"$f":"PERSONNEL[[#This Row],[RTT Droits]]-PERSONNEL[[#This Row],[RTT Pris]]","v":0}]
["MINAKIAN Mathilde",null,"m.minakian","LSE","SUD","2013-10-18",1,-5.5,{"$f":"IF(YEAR(PERSONNEL[[#This Row],[entrée]])=YEAR(CPdeb),0,MIN(4,INT((CPdeb-PERSONNEL[[#This Row],[entrée]])/365/5)))","v":0},19.46,8.32,{"$f":"SUMIFS(Tabsaisies[NB jours],Tabsaisies[Salarié],Personnel!$A25,Tabsaisies[Nature],\"CP\",Tabsaisies[Statut],\"Acceptée\",Tabsaisies[Début],\">=\"&$H$1,Tabsaisies[Fin],\"<=\"&$J$1)","v":23.5},null,null,0.67,0.67,0.67,null,null,null,null,null,null,null,null,null,{"$f":"MROUND(Personnel!$M25*SUM(Personnel!$N25:$Z25),0.5)","v":0},{"$f":"SUMIFS(Tabsaisies[NB jours],Tabsaisies[Salarié],Personnel!$A25,Tabsaisies[Nature],\"RTT\",Tabsaisies[Statut],\"Acceptée\",Tabsaisies[Début],\">=\"&$P$1)","v":0},{"$f":"PERSONNEL[[#This Row],[RTT Droits]]-PERSONNEL[[#This Row],[RTT Pris]]","v":0}]
["MARZOUK Sami",null,"s.marzouk","LSE","IDF","1981-10-01",1,0,{"$f":"IF(YEAR(PERSONNEL[[#This Row],[entrée]])=YEAR(CPdeb),0,MIN(4,INT((CPdeb-PERSONNEL[[#This Row],[entrée]])/365/5)))","v":4},28.96,10.4,{"$f":"SUMIFS(Tabsaisies[NB jours],Tabsaisies[Salarié],Personnel!$A26,Tabsaisies[Nature],\"CP\",Tabsaisies[Statut],\"Acceptée\",Tabsaisies[Début],\">=\"&$H$1,Tabsaisies[Fin],\"<=\"&$J$1)","v":21},1,1,0.67,0.67,0.67,null,null,null,null,null,null,null,null,null,{"$f":"MROUND(Personnel!$M26*SUM(Personnel!$N26:$Z26),0.5)","v":3},{"$f":"SUMIFS(Tabsaisies[NB jours],Tabsaisies[Salarié],Personnel!$A26,Tabsaisies[Nature],\"RTT\",Tabsaisies[Statut],\"Acceptée\",Tabsaisies[Début],\">=\"&$P$1)","v":2},{"$f":"PERSONNEL[[#This Row],[RTT Droits]]-PERSONNEL[[#This Row],[RTT Pris]]","v":1}]
["PLONQUET Christian",null,"p.plonquet","LSE","NO","2012-10-01",{"$f":"1*3/5","v":0.6},-6.5,{"$f":"IF(YEAR(PERSONNEL[[#This Row],[entrée]])=YEAR(CPdeb),0,MIN(4,INT((CPdeb-PERSONNEL[[#This Row],[entrée]])/365/5)))","v":0},8.4759999999999991,10.4,{"$f":"SUMIFS(Tabsaisies[NB jours],Tabsaisies[Salarié],Personnel!$A27,Tabsaisies[Nature],\"CP\",Tabsaisies[Statut],\"Acceptée\",Tabsaisies[Début],\">=\"&$H$1,Tabsaisies[Fin],\"<=\"&$J$1)","v":0},0,0,0.67,0.67,0.67,null,null,null,null,null,null,null,null,null,{"$f":"MROUND(Personnel!$M27*SUM(Personnel!$N27:$Z27),0.5)","v":0},{"$f":"SUMIFS(Tabsaisies[NB jours],Tabsaisies[Salarié],Personnel!$A27,Tabsaisies[Nature],\"RTT\",Tabsaisies[Statut],\"Acceptée\",Tabsaisies[Début],\">=\"&$P$1)","v":0},{"$f":"PERSONNEL[[#This Row],[RTT Droits]]-PERSONNEL[[#This Row],[RTT Pris]]","v":0}]
["POMMERELL Patrick",null,"p.pommerell","LSE","IDF","1989-10-01",1,7.5,{"$f":"IF(YEAR(PERSONNEL[[#This Row],[entrée]])=YEAR(CPdeb),0,MIN(4,INT((CPdeb-PERSONNEL[[#This Row],[entrée]])/365/5)))","v":4},36.46,10.4,{"$f":"SUMIFS(Tabsaisies[NB jours],Tabsaisies[Salarié],Personnel!$A28,Tabsaisies[Nature],\"CP\",Tabsaisies[Statut],\"Acceptée\",Tabsaisies[Début],\">=\"&$H$1,Tabsaisies[Fin],\"<=\"&$J$1)","v":24},1,2.5,0.67,0.67,0.67,null,null,null,null,null,null,null,null,null,{"$f":"MROUND(Personnel!$M28*SUM(Personnel!$N28:$Z28),0.5)","v":4.5},{"$f":"SUMIFS(Tabsaisies[NB jours],Tabsaisies[Salarié],Personnel!$A28,Tabsaisies[Nature],\"RTT\",Tabsaisies[Statut],\"Acceptée\",Tabsaisies[Début],\">=\"&$P$1)","v":4.5},{"$f":"PERSONNEL[[#This Row],[RTT Droits]]-PERSONNEL[[#This Row],[RTT Pris]]","v":0}]
["PONS Olivier",null,"o.pons","LSE","SUD","2010-09-01",1,1,{"$f":"IF(YEAR(PERSONNEL[[#This Row],[entrée]])=YEAR(CPdeb),0,MIN(4,INT((CPdeb-PERSONNEL[[#This Row],[entrée]])/365/5)))","v":0},25.96,10.4,{"$f":"SUMIFS(Tabsaisies[NB jours],Tabsaisies[Salarié],Personnel!$A29,Tabsaisies[Nature],\"CP\",Tabsaisies[Statut],\"Acceptée\",Tabsaisies[Début],\">=\"&$H$1,Tabsaisies[Fin],\"<=\"&$J$1)","v":15},1,4,0.67,0.67,0.67,null,null,null,null,null,null,null,null,null,{"$f":"MROUND(Personnel!$M29*SUM(Personnel!$N29:$Z29),0.5)","v":6},{"$f":"SUMIFS(Tabsaisies[NB jours],Tabsaisies[Salarié],Personnel!$A29,Tabsaisies[Nature],\"RTT\",Tabsaisies[Statut],\"Acceptée\",Tabsaisies[Début],\">=\"&$P$1)","v":5},{"$f":"PERSONNEL[[#This Row],[RTT Droits]]-PERSONNEL[[#This Row],[RTT Pris]]","v":1}]
["ROBIN Kevin",null,"k.robin","LSE","IDF","2012-11-01",1,null,{"$f":"IF(YEAR(PERSONNEL[[#This Row],[entrée]])=YEAR(CPdeb),0,MIN(4,INT((CPdeb-PERSONNEL[[#This Row],[entrée]])/365/5)))","v":0},24.96,10.4,{"$f":"SUMIFS(Tabsaisies[NB jours],Tabsaisies[Salarié],Personnel!$A30,Tabsaisies[Nature],\"CP\",Tabsaisies[Statut],\"Acceptée\",Tabsaisies[Début],\">=\"&$H$1,Tabsaisies[Fin],\"<=\"&$J$1)","v":0},null,0,0.67,0.67,0.67,null,null,null,null,null,null,null,null,null,{"$f":"MROUND(Personnel!$M30*SUM(Personnel!$N30:$Z30),0.5)","v":0},{"$f":"SUMIFS(Tabsaisies[NB jours],Tabsaisies[Salarié],Personnel!$A30,Tabsaisies[Nature],\"RTT\",Tabsaisies[Statut],\"Acceptée\",Tabsaisies[Début],\">=\"&$P$1)","v":0},{"$f":"PERSONNEL[[#This Row],[RTT Droits]]-PERSONNEL[[#This Row],[RTT Pris]]","v":0}]
["RUBIO Isabel",null,"i.rubio","SOCAGI","IDF","2008-01-01",1,null,{"$f":"IF(YEAR(PERSONNEL[[#This Row],[entrée]])=YEAR(CPdeb),0,MIN(4,INT((CPdeb-PERSONNEL[[#This Row],[entrée]])/365/5)))","v":1},25.96,10.4,{"$f":"SUMIFS(Tabsaisies[NB jours],Tabsaisies[Salarié],Personnel!$A31,Tabsaisies[Nature],\"CP\",Tabsaisies[Statut],\"Acceptée\",Tabsaisies[Début],\">=\"&$H$1,Tabsaisies[Fin],\"<=\"&$J$1)","v":0},1,0,0.67,0.67,0.67,null,null,null,null,null,null,null,null,null,{"$f":"MROUND(Personnel!$M31*SUM(Personnel!$N31:$Z31),0.5)","v":2},{"$f":"SUMIFS(Tabsaisies[NB jours],Tabsaisies[Salarié],Personnel!$A31,Tabsaisies[Nature],\"RTT\",Tabsaisies[Statut],\"Acceptée\",Tabsaisies[Début],\">=\"&$P$1)","v":0},{"$f":"PERSONNEL[[#This Row],[RTT Droits]]-PERSONNEL[[#This Row],[RTT Pris]]","v":2}]
["SANTUCCI Lionel",null,"l.santucci","LSE","SUD","1992-05-01",1,0,{"$f":"IF(YEAR(PERSONNEL[[#This Row],[entrée]])=YEAR(CPdeb),0,MIN(4,INT((CPdeb-PERSONNEL[[#This Row],[entrée]])/365/5)))","v":4},28.96,10.4,{"$f":"SUMIFS(Tabsaisies[NB jours],Tabsaisies[Salarié],Personnel!$A32,Tabsaisies[Nature],\"CP\",Tabsaisies[Statut],\"Acceptée\",Tabsaisies[Début],\">=\"&$H$1,Tabsaisies[Fin],\"<=\"&$J$1)","v":19},1,2,0.67,0.67,0.67,null,null,null,null,null,null,null,null,null,{"$f":"MROUND(Personnel!$M32*SUM(Personnel!$N32:$Z32),0.5)","v":4},{"$f":"SUMIFS(Tabsaisies[NB jours],Tabsaisies[Salarié],Personnel!$A32,Tabsaisies[Nature],\"RTT\",Tabsaisies[Statut],\"Acceptée\",Tabsaisies[Début],\">=\"&$P$1)","v":4},{"$f":"PERSONNEL[[#This Row],[RTT Droits]]-PERSONNEL[[#This Row],[RTT Pris]]","v":0}]
["SOUCHET Alain",null,"a.souchet","LSE","IDF","1991-01-01",1,1,{"$f":"IF(YEAR(PERSONNEL[[#This Row],[entrée]])=YEAR(CPdeb),0,MIN(4,INT((CPdeb-PERSONNEL[[#This Row],[entrée]])/365/5)))","v":4},29.96,6.24,{"$f":"SUMIFS(Tabsaisies[NB jours],Tabsaisies[Salarié],Personnel!$A33,Tabsaisies[Nature],\"CP\",Tabsaisies[Statut],\"Acceptée\",Tabsaisies[Début],\">=\"&$H$1,Tabsaisies[Fin],\"<=\"&$J$1)","v":17},1,3.5,0.67,0.67,0.67,null,null,null,null,null,null,null,null,null,{"$f":"MROUND(Personnel!$M33*SUM(Personnel!$N33:$Z33),0.5)","v":5.5},{"$f":"SUMIFS(Tabsaisies[NB jours],Tabsaisies[Salarié],Personnel!$A33,Tabsaisies[Nature],\"RTT\",Tabsaisies[Statut],\"Acceptée\",Tabsaisies[Début],\">=\"&$P$1)","v":1},{"$f":"PERSONNEL[[#This Row],[RTT Droits]]-PERSONNEL[[#This Row],[RTT Pris]]","v":4.5}]
["TAQUET Alain",null,"a.taquet","LSE","NO","2006-12-01",1,1.5,{"$f":"IF(YEAR(PERSONNEL[[#This Row],[entrée]])=YEAR(CPdeb),0,MIN(4,INT((CPdeb-PERSONNEL[[#This Row],[entrée]])/365/5)))","v":1},27.46,10.4,{"$f":"SUMIFS(Tabsaisies[NB jours],Tabsaisies[Salarié],Personnel!$A34,Tabsaisies[Nature],\"CP\",Tabsaisies[Statut],\"Acceptée\",Tabsaisies[Début],\">=\"&$H$1,Tabsaisies[Fin],\"<=\"&$J$1)","v":17.5},1,4,0.67,0.67,0.67,null,null,null,null,null,null,null,null,null,{"$f":"MROUND(Personnel!$M34*SUM(Personnel!$N34:$Z34),0.5)","v":6},{"$f":"SUMIFS(Tabsaisies[NB jours],Tabsaisies[Salarié],Personnel!$A34,Tabsaisies[Nature],\"RTT\",Tabsaisies[Statut],\"Acceptée\",Tabsaisies[Début],\">=\"&$P$1)","v":6},{"$f":"PERSONNEL[[#This Row],[RTT Droits]]-PERSONNEL[[#This Row],[RTT Pris]]","v":0}]
["VAUTRAIN Franck",null,"f.vautrain","LSE","SUD","2011-06-01",1,0,{"$f":"IF(YEAR(PERSONNEL[[#This Row],[entrée]])=YEAR(CPdeb),0,MIN(4,INT((CPdeb-PERSONNEL[[#This Row],[entrée]])/365/5)))","v":0},24.96,10.4,{"$f":"SUMIFS(Tabsaisies[NB jours],Tabsaisies[Salarié],Personnel!$A35,Tabsaisies[Nature],\"CP\",Tabsaisies[Statut],\"Acceptée\",Tabsaisies[Début],\">=\"&$H$1,Tabsaisies[Fin],\"<=\"&$J$1)","v":16},1,4,0.67,0.67,0.67,null,null,null,null,null,null,null,null,null,{"$f":"MROUND(Personnel!$M35*SUM(Personnel!$N35:$Z35),0.5)","v":6},{"$f":"SUMIFS(Tabsaisies[NB jours],Tabsaisies[Salarié],Personnel!$A35,Tabsaisies[Nature],\"RTT\",Tabsaisies[Statut],\"Acceptée\",Tabsaisies[Début],\">=\"&$P$1)","v":5},{"$f":"PERSONNEL[[#This Row],[RTT Droits]]-PERSONNEL[[#This Row],[RTT Pris]]","v":1}]

{"sheet":"Feuil1","index":6,"n_rows":40,"n_cols":14,"rows_kept":40,"cut":false,"hidden":false,"merged":[]}
[]
[]
[]
["Nature","CP"]
[]
["Somme de NB jours","mois"]
[null,"2014",null,null,null,null,null,null,"2015",null,null,null,null,"Total général"]
["Étiquettes de lignes","juin","juil","août","sept","oct","nov","déc","janv","févr","mars","avr","mai"]
["BEARZATTO Giovanni",null,1,10,6,null,null,null,null,6,2,null,1,26]
["BERTHE Magali",null,null,9,null,null,1.5,null,1,null,null,null,1,12.5]
["CHEVALIER Yohan",null,4,5,null,null,null,0,null,null,null,null,2,11]
["COUTANT Jean Paul",1,null,15,null,null,null,null,null,null,1,5,1,23]
["DEREPPE Bruno",null,4,10,5,null,null,null,null,null,5,null,4,28]
["DREVON Alain",null,4,6,5,null,null,null,null,5,null,null,5.5,25.5]
["DREZET Olivier",1,null,16,4,null,1,1,null,null,null,4,1,28]
["GIRAUDON Alain",1,null,20,null,null,null,null,null,null,5,null,null,26]
["GUERIN Viviane",1,1,17,1,null,null,0,null,null,null,null,5,25]
["GUINOT Nathalie",null,null,15,null,null,null,null,null,5,null,2,3,25]
["GUIOT Fabien",null,null,15,null,null,null,1,null,null,null,4,5,25]
["HAUTEBRANC Alexis",null,4,6,5,1,null,0.5,null,null,2.5,null,6,25]
["HEMLER Christelle",null,4,6,5,null,null,0.5,null,null,2,2,6,25.5]
["KADEM Christophe",null,null,15,null,null,null,1,null,null,5,null,4.5,25.5]
["LANGE Sébastien",null,null,null,null,null,null,null,1,null,null,null,0.5,1.5]
["LAZZARO Fabien",null,4,11,null,null,null,null,null,null,null,null,null,15]
["LEDANT Charles",null,null,17,null,null,1,null,2,null,3,1,5,29]
["LOCATELLI Bruno",null,null,5,11,null,null,null,null,null,5,1,5,27]
["LOYER Michel",1,7,10,1,1,null,1,null,null,2,null,3,26]
["MARAIS Bernard",null,null,9,10,null,null,1,1,5,null,null,1,27]
["MARZOUK Sami",null,null,20,null,null,null,1,null,null,null,8,null,29]
["MINAKIAN Mathilde",null,1,15,null,null,1,null,1,null,null,null,null,18]
["PLONQUET Christian",null,null,17,5,0,2,null,null,null,null,null,null,24]
["POMMERELL Patrick",null,null,15,null,null,null,null,null,2,null,4,0,21]
["PONS Olivier",null,5,10,null,null,null,null,null,7,null,null,null,22]
["ROBIN Kevin",null,1,15,null,null,1,1.5,1,2,1,1.5,null,24]
["SANTUCCI Lionel",null,null,15,1,null,null,1,null,null,2,3,8,30]
["SIODMAK Eric",null,null,14,2,null,null,1,null,5,0,4,null,26]
["SOUCHET Alain",null,null,20,null,null,null,null,null,null,null,2.5,7,29.5]
["TAQUET Alain",2,null,14,1,null,null,null,null,null,4,null,5.5,26.5]
["VAUTRAIN Franck",null,null,15,null,null,null,0,null,null,null,5,5,25]
["Total général",7,40,387,62,2,7.5,10.5,7,37,39.5,47,85,731.5]